program: Gaussian 09
title: 000280126
version: EM64L-G09RevD.01
frameworkgroup: C1[X(C23H16N2)]
method: RPBEPBE
basis: SDD
operation: Freq
keyword: #pfreq=noraman
keyword: PBEPBE/SDD
title: #p freq=noraman PBEPBE/SDD
converged: YES YES NO NO
title: Mulliken charges:
elementType: N N C C C C C C C C C C C C C C C C C C C C C C C H H H H H H H H H H H H H H H H
charge: -0.408284 -0.050432 0.068744 0.073900 0.109998 0.092635 0.308028 0.297348 0.276056 -0.399007 -0.399217 -0.383527 -0.383343 -0.378804 -0.378765 -0.238518 -0.225643 -0.225599 -0.225066 -0.225027 -0.217423 -0.217403 -0.242706 -0.236603 -0.233471 0.327895 0.233488 0.233638 0.242251 0.242217 0.246506 0.246506 0.225590 0.225597 0.230649 0.230652 0.231352 0.231359 0.228145 0.232985 0.233299
chargesum: 0.00000
title: Mulliken charges with hydrogens summed into heavy atoms:
elementType: N N C C C C C C C C C C C C C C C C C C C C C C C
charge: -0.080389 -0.050432 0.068744 0.073900 0.109998 0.092635 0.308028 0.297348 0.276056 -0.165519 -0.165579 -0.141276 -0.141126 -0.132299 -0.132259 -0.238518 -0.000053 -0.000002 0.005583 0.005626 0.013929 0.013956 -0.014561 -0.003619 -0.000171
polarizability: 3.11358013e+02 4.75061122e+00 2.27863576e+02 -2.65981483e-02 -8.52708580e-02 2.15204514e+02
1716.lowfreq: -54.0986 -43.3242 -38.8214 -5.7268 -2.7046 -0.0004 -0.0003 0.0006 0.5920
frequency: -54.0906 -43.2934 -38.7792 33.3898 40.0540 45.9624 47.4847 80.5940 102.6124 140.1380 145.1413 220.7414 221.4013 228.8842 292.0188 310.5499 329.9437 358.2694 399.2072 400.2264 401.8316 402.4649 484.0911 495.9618 503.3173 524.9274 534.2498 597.8237 609.6576 612.9313 618.3372 644.4712 646.4303 662.7615 687.4578 702.7502 704.1091 704.8358 705.2819 737.8876 739.8613 768.0146 775.9190 800.0202 849.3054 855.9774 856.9540 922.0113 929.1137 931.6554 953.4638 973.0441 980.0275 980.4094 987.4365 988.9282 989.4388 994.5421 995.2351 999.9023 1000.8126 1023.9791 1029.9712 1037.2931 1076.4468 1076.9966 1077.4810 1097.3766 1164.7882 1172.0057 1173.5680 1174.0778 1185.6036 1187.1516 1188.0957 1237.8897 1277.4749 1305.9328 1309.5910 1309.8728 1311.3156 1368.3803 1368.9463 1369.2941 1404.6633 1428.4042 1428.9910 1429.8515 1430.2133 1460.2978 1474.0625 1498.2775 1543.2890 1581.1116 1582.7864 1583.5926 1584.2922 1615.7638 1618.6184 1627.1395 2182.9730 3122.4153 3125.6932 3127.6144 3127.6175 3131.2810 3133.7901 3139.9509 3142.3844 3144.7144 3149.1583 3152.3692 3154.3936 3164.5464 3166.7350 3168.3214 3583.7975
redmass: 4.1983 3.6947 3.7583 5.6332 5.5083 5.5780 6.1049 8.2899 5.0143 6.5516 5.8652 5.1145 4.9336 5.1844 6.6305 6.2573 6.0423 5.5600 2.8100 2.8130 2.8089 5.7095 7.5979 3.8381 3.9859 10.8231 4.3608 6.8399 6.5446 6.5513 6.5407 4.1103 1.0925 6.6110 6.2173 1.6782 1.7157 9.6828 1.7329 2.9814 10.5785 1.8363 2.1086 2.6692 1.2467 1.2425 1.2417 1.4565 1.4093 1.4376 7.5471 1.3905 1.3885 1.3882 6.0044 5.8468 6.0207 7.1013 1.3669 1.3235 1.3333 2.5192 2.0732 1.9379 1.6056 1.5910 1.6029 2.7789 4.7531 1.0532 1.0544 1.0540 1.1114 1.1144 1.1154 3.8396 2.1267 5.4910 1.3767 1.3721 1.3709 6.5718 6.8904 7.1069 4.7754 3.4939 2.1983 2.2004 2.2128 2.4665 2.3246 3.1770 6.6544 6.0827 5.9414 5.9721 6.0448 6.3362 6.4803 7.0668 12.6076 1.0844 1.0847 1.0848 1.0877 1.0880 1.0880 1.0925 1.0927 1.0927 1.0969 1.0969 1.0971 1.1018 1.1018 1.1019 1.0811
irintensity: 0.2273 0.0015 0.0187 1.0871 0.2028 0.8539 1.2104 2.8825 0.2550 0.2370 0.9105 0.3949 0.3131 0.1959 0.0983 0.0101 0.0169 0.6107 0.0144 0.0200 0.0009 2.8560 1.0012 12.0502 3.5444 0.5612 17.5332 15.2633 0.0080 0.0617 0.0000 0.3743 56.6682 0.8527 0.5781 65.2932 44.1097 0.4936 43.8956 24.0052 0.1008 81.9471 29.6390 7.9888 0.0049 0.0042 1.2833 3.3502 4.8096 0.4196 11.7653 0.0070 0.0004 0.4412 1.6076 2.5787 2.2677 0.0872 0.0913 0.1784 0.1271 19.4082 4.9000 2.7672 4.1495 0.8491 24.2074 4.8316 7.0871 0.0002 0.0015 0.0000 1.5688 4.2893 0.4730 0.3873 14.3051 17.3754 0.6359 0.0247 1.0082 0.0850 0.2901 0.0459 3.0279 79.7015 0.0884 22.4129 1.5382 13.5508 49.5024 9.9384 5.2736 8.3485 0.4823 3.7814 1.0284 5.0332 1.4607 2.0511 71.8888 2.7540 1.9878 1.3809 0.1473 0.3212 0.3189 21.1553 20.7323 17.6284 28.3393 37.1277 32.0677 22.6288 23.3298 20.8274 68.6691
temp: 298.150 k
press: 1.00000 atm
elementType: 7 7 6 6 6 6 6 6 6 6 6 6 6 6 6 6 6 6 6 6 6 6 6 6 6 1 1 1 1 1 1 1 1 1 1 1 1 1 1 1 1
symmnumber: 1
zpe: 833695.0 jmol-1
zpe.correction: 0.317538 hartree
zpe.thermalcorrener: 0.335370 hartree
zpe.thermalcorrenthalpy: 0.336314 hartree
zpe.thermalcorrgfe: 0.270258 hartree
zpe.sumelectzpe: -993.876411 hartree
zpe.sumelectthermal: -993.858579 hartree
zpe.sumelectthermalent: -993.857635 hartree
zpe.sumelectthermalfe: -993.923691 hartree
dipole: 0.8630 6.4067 0.0019
dipole: 6.4646
quadrupole: -123.9861 -156.4874 -127.7458
quadrupole: -10.8350 -0.0061 -0.0279
quadrupole: 12.0870 -20.4143 8.3273 -10.8350 -0.0061 -0.0279
hfenergy: -994.193949 hartree
pointgroup: C01 [X(C23H16N2)]
dipole: -0.3659505 2.5169066 0.0000354 debye
polarizability: 311.4484375|-3.8742529|227.7730947|-0.0332414|0.0890397|215.2045704 unknown
InChI: InChI=1S/C23H16N2/c24-16-20-21(17-10-4-1-5-11-17)23(19-14-8-3-9-15-19)25-22(20)18-12-6-2-7-13-18/h1-15,25H
charge 0 multiplicity 1
41 atoms
N  0.820769 1.24193 0.000403
N  1.760635 -3.469207 -0.000129
C  -0.514386 -0.582382 0.000158
C  -0.519029 0.819428 0.000349
C  1.691358 0.159635 0.000256
C  0.881219 -0.998873 0.000114
C  -1.702885 -1.481023 0.000097
C  -1.636429 1.801687 0.000423
C  3.168854 0.326019 0.000234
C  -2.27639 -1.921815 1.221272
C  -2.270909 -1.928888 -1.221065
C  -2.174281 2.283874 1.222986
C  -2.17707 2.280844 -1.222098
C  3.884732 0.407401 -1.223405
C  3.88528 0.402785 1.223846
C  1.362799 -2.339855 -0.000053
C  -3.394664 -2.784939 1.22219
C  -3.389154 -2.792047 -1.221996
C  -3.226354 3.226763 1.223586
C  -3.22917 3.223703 -1.222624
C  5.288283 0.567808 -1.223055
C  5.288832 0.563171 1.223464
C  -3.955238 -3.222211 0.000089
C  -3.755071 3.700261 0.000493
C  5.993034 0.648043 0.000203
H  1.116261 2.218199 0.000489
H  -1.837737 -1.590276 2.169354
H  -1.827991 -1.602873 -2.169074
H  -1.770445 1.909408 2.170515
H  -1.775379 1.904024 -2.169601
H  3.339371 0.330693 -2.170691
H  3.340333 0.322558 2.171075
H  -3.82474 -3.118182 2.173406
H  -3.814945 -3.130824 -2.173187
H  -3.635069 3.586969 2.174132
H  -3.640064 3.581543 -2.173125
H  5.830248 0.622826 -2.17349
H  5.831223 0.614609 2.173857
H  -4.82072 -3.894366 0.00009
H  -4.572642 4.429772 0.000523
H  7.082129 0.767802 0.000186
