program: Gaussian 09
title: 000280110
version: EM64L-G09RevD.01
frameworkgroup: C1[X(C15H16N2O)]
method: RPBEPBE
basis: SDD
operation: Freq
keyword: #p
keyword: freq=noraman
keyword: PBEPBE/SDD
title: #p freq=noraman PBEPBE/SDD
converged: YES YES NO NO
title: Mulliken charges:
elementType: O N N C C C C C C C C C C C C C C C H H H H H H H H H H H H H H H H
charge: -0.239933 -0.278761 0.009836 -0.042659 -0.554085 -0.178212 0.269946 0.203908 0.323334 -0.713662 -0.709141 -0.226492 -0.295762 -0.304014 -0.388570 -0.239823 -0.254359 -0.148443 0.235941 0.237015 0.240803 0.284310 0.209299 0.223766 0.205499 0.213605 0.198536 0.247757 0.243771 0.241862 0.284729 0.234535 0.232250 0.233212
chargesum: 0.00000
title: Mulliken charges with hydrogens summed into heavy atoms:
elementType: O N N C C C C C C C C C C C C C C C
charge: -0.239933 -0.278761 0.009836 0.193282 -0.076266 0.106099 0.269946 0.203908 0.323334 -0.075099 -0.049242 0.017279 -0.053900 -0.019285 -0.154035 -0.007572 -0.021147 -0.148443
polarizability: 2.22491075e+02 -1.65425669e+01 1.83927343e+02 -1.60107887e+00 -1.28292796e+01 1.21694691e+02
1716.lowfreq: -4.6817 -0.7510 0.0007 0.0008 0.0009 8.1669 27.3202 41.6936 55.3445
frequency: 27.2573 41.6591 55.3169 67.0716 91.4218 115.7394 125.5437 182.8438 194.4890 200.1560 224.6904 236.5759 255.7700 307.2967 349.9969 377.6459 387.1777 389.8946 411.1625 430.6359 467.4045 475.0769 502.3263 534.7880 564.7478 584.5774 592.8100 653.5178 704.6929 712.2574 759.2813 776.7530 793.0053 819.6897 837.9054 871.0459 896.7021 908.5395 918.0875 931.6890 946.7239 960.3184 967.4273 970.8450 986.5049 1001.6481 1040.6855 1082.1950 1106.4108 1115.3304 1132.3048 1173.0682 1180.4124 1182.0794 1196.2642 1226.5762 1232.3908 1247.9284 1259.9125 1282.1486 1293.7487 1322.3022 1344.9816 1365.2389 1377.0979 1378.0494 1389.6723 1395.2479 1439.5925 1445.8122 1465.9131 1471.7520 1481.2297 1484.0673 1489.7562 1576.8226 1595.3518 1614.5829 1660.3875 2179.1707 2948.9638 2966.8012 2974.2260 3005.1774 3021.5639 3056.6300 3058.4901 3067.7093 3074.1784 3090.7327 3128.1486 3133.5705 3143.4779 3166.1501 3170.9606 3212.5600
redmass: 4.9365 5.2057 3.1984 5.1640 4.9826 3.5054 3.9604 3.9320 4.3679 1.0654 1.7909 2.4708 2.4152 5.9801 2.9635 3.9056 2.6984 4.6557 4.7522 2.5255 3.5611 4.8883 5.5974 3.7055 3.9102 5.2843 5.3131 5.1591 1.9159 5.6257 1.7345 1.7735 4.3284 3.7231 2.9581 1.4566 1.8702 4.3829 1.2210 2.9803 1.3639 1.5477 1.3409 2.0971 1.3412 3.2518 2.4633 3.0735 1.6987 2.2742 1.9353 1.2107 1.4121 1.4332 2.3755 2.0782 1.3472 2.2006 1.3535 1.4839 1.5915 1.5561 1.3845 1.6040 1.3070 1.6425 5.6241 1.2216 1.1053 2.3091 1.0566 1.0486 1.0663 2.6492 1.0490 6.6985 7.9663 7.3042 7.0011 12.5569 1.0607 1.0360 1.0380 1.0899 1.0922 1.0829 1.0987 1.0986 1.0982 1.0989 1.0878 1.0876 1.0904 1.0988 1.0995 1.0942
irintensity: 1.2194 1.8751 0.6167 1.1445 1.8565 1.3265 3.7676 3.0733 3.8765 0.0594 0.3172 1.2824 5.0670 1.4103 3.0288 1.8107 0.6604 0.2658 6.2714 0.2072 11.4358 4.8462 1.1198 1.6716 0.9141 1.7210 4.7210 7.0842 13.0500 2.8984 33.9683 56.6905 15.6191 1.7835 6.6771 1.9739 18.7976 36.8301 11.2332 11.9267 0.6676 1.2081 5.8408 4.7750 0.5282 7.5811 1.7104 20.7850 4.7003 28.9967 14.2790 0.8124 9.4053 19.0514 144.9631 81.7967 37.8449 142.3385 10.3404 53.6258 2.1873 1.2274 4.6602 94.4558 22.6988 16.8384 0.6799 8.9799 8.2748 22.1671 5.5968 5.5236 5.0971 57.5634 26.2569 2.1242 122.4270 50.8065 18.6534 0.1468 24.6486 36.6984 26.1823 1.4116 8.2663 2.2212 25.4788 35.0573 73.5054 32.8919 2.9958 7.5322 13.4640 29.0378 11.1936 1.3392
temp: 298.150 k
press: 1.00000 atm
elementType: 8 7 7 6 6 6 6 6 6 6 6 6 6 6 6 6 6 6 1 1 1 1 1 1 1 1 1 1 1 1 1 1 1 1
symmnumber: 1
zpe: 718109.5 jmol-1
zpe.correction: 0.273513 hartree
zpe.thermalcorrener: 0.290479 hartree
zpe.thermalcorrenthalpy: 0.291423 hartree
zpe.thermalcorrgfe: 0.228074 hartree
zpe.sumelectzpe: -764.603389 hartree
zpe.sumelectthermal: -764.586423 hartree
zpe.sumelectthermalent: -764.585479 hartree
zpe.sumelectthermalfe: -764.648829 hartree
dipole: 0.5433 1.2950 -2.8041
dipole: 3.1361
quadrupole: -90.8155 -107.9754 -116.5160
quadrupole: -3.3257 -1.1900 -15.9590
quadrupole: 14.2868 -2.8731 -11.4137 -3.3257 -1.1900 -15.9590
hfenergy: -764.8769024 hartree
pointgroup: C01 [X(C15H16N2O1)]
dipole: 0.1878717 -0.5029488 1.1109176 debye
polarizability: 222.9531493|16.1299638|183.1638588|2.8493427|-13.1533457|121.9961015 unknown
InChI: InChI=1S/C15H16N2O/c1-11(2)9-15(18)17-13(10-16)8-7-12-5-3-4-6-14(12)17/h3-8,11,13H,9H2,1-2H3
charge 0 multiplicity 1
34 atoms
O  -1.129818 1.904447 0.44204
N  0.013623 -0.113558 0.127147
N  -0.122633 -2.542253 -2.426984
C  -3.739284 0.824644 0.197177
C  -2.509034 -0.112991 0.312096
C  -0.052159 -1.601792 0.093544
C  1.317866 0.492088 -0.020842
C  -1.17345 0.650647 0.299519
C  2.460292 -0.248415 0.423045
C  -5.025362 0.047879 0.562997
C  -3.84394 1.436212 -1.219484
C  1.097813 -2.246358 0.861996
C  2.278168 -1.58512 0.991216
C  1.496148 1.781328 -0.577427
C  3.751038 0.328538 0.312674
C  2.792501 2.329851 -0.687382
C  3.925602 1.611835 -0.239365
C  -0.092743 -2.116535 -1.312668
H  -3.596259 1.652187 0.917743
H  -2.582768 -0.685924 1.261701
H  -2.545163 -0.851378 -0.513941
H  -0.996657 -1.912059 0.568505
H  -4.9840 -0.346509 1.596286
H  -5.911409 0.704141 0.487425
H  -5.183465 -0.806865 -0.12323
H  -4.714934 2.113398 -1.287154
H  -3.972236 0.644134 -1.983262
H  -2.942076 2.021668 -1.467207
H  0.931822 -3.252658 1.256875
H  3.121199 -2.049228 1.51598
H  0.632348 2.359476 -0.903805
H  4.61732 -0.247351 0.659369
H  2.912209 3.3264 -1.125732
H  4.92654 2.047219 -0.323153
