program: Gaussian 09
title: 000280103
version: EM64L-G09RevD.01
frameworkgroup: C1[X(C12H10N2O)]
method: RPBEPBE
basis: SDD
operation: Freq
keyword: #p
keyword: freq=noraman
keyword: PBEPBE/SDD
title: #p freq=noraman PBEPBE/SDD
converged: YES YES NO NO
title: Mulliken charges:
elementType: O N N C C C C C C C C C C C C H H H H H H H H H H
charge: -0.255283 -0.191511 0.004755 -0.286274 0.340495 0.345585 -0.149515 -0.386335 -0.393372 -0.402344 0.249538 -0.237963 -0.229829 -0.136390 -0.795336 0.315980 0.250802 0.237369 0.247299 0.237375 0.234628 0.233347 0.275640 0.243089 0.248251
chargesum: 0.00000
title: Mulliken charges with hydrogens summed into heavy atoms:
elementType: O N N C C C C C C C C C C C C
charge: -0.255283 -0.191511 0.004755 0.029706 0.340495 0.345585 0.101287 -0.148966 -0.146073 -0.164969 0.249538 -0.003336 0.003518 -0.136390 -0.028356
polarizability: 2.06360590e+02 -2.81927060e+00 1.30718247e+02 -4.42979323e+00 -1.59954578e+01 9.87696641e+01
1716.lowfreq: -9.5416 -5.1068 -0.0005 0.0005 0.0005 6.5814 41.2115 80.9364 90.0352
frequency: 41.1690 80.9348 90.0350 94.1454 151.4853 168.3985 210.4734 220.5550 303.5887 314.7294 340.5645 396.2869 420.5399 450.1899 501.3960 523.4911 552.9091 561.8910 572.6221 606.8812 637.9404 682.3103 742.4128 750.5023 777.4236 790.2366 838.6455 880.6653 900.0801 927.2420 937.6679 952.7415 969.1041 990.7521 1032.5656 1035.0320 1043.7248 1114.0793 1133.4865 1176.6950 1191.6562 1221.1682 1234.5709 1278.8619 1297.6735 1305.7371 1334.2682 1381.4393 1383.3218 1411.2487 1448.2103 1455.6050 1470.2537 1489.4603 1573.3313 1602.1391 1614.8057 1636.3434 2186.2219 2993.0365 3018.4051 3079.5746 3126.6919 3131.4305 3137.2332 3147.6738 3161.3586 3167.9393 3193.6252
redmass: 5.7398 5.0769 6.0567 6.7140 2.7150 1.2908 3.7811 5.2619 6.0054 4.1165 5.1751 4.0437 4.2434 4.7927 4.7518 5.2147 4.9429 4.4157 3.3093 3.9408 6.1178 4.2953 2.6327 1.5156 2.7258 1.9558 4.2698 1.6067 4.4362 1.3644 3.7037 1.5046 2.3236 1.3425 2.3300 1.6738 2.2266 1.9401 1.6326 1.0622 1.6585 2.2390 1.9804 1.7430 1.5413 3.9873 1.3576 2.9022 1.5358 1.9899 2.0774 1.1726 1.0505 2.8999 6.8328 7.5810 6.8209 6.6595 12.5788 1.0387 1.0826 1.0975 1.0866 1.0901 1.0984 1.0939 1.0882 1.1004 1.0981
irintensity: 0.3656 2.9247 1.6215 4.8558 5.6898 1.3756 0.5977 2.8976 4.4007 1.8802 2.0386 3.1622 6.4173 5.1690 2.3805 4.9122 15.1205 10.8739 3.5104 2.0174 2.7782 13.0775 15.2943 14.0466 46.4073 65.0413 14.5380 9.3986 19.3002 2.8950 32.5547 3.1165 12.1125 0.2632 8.1417 7.7331 24.7349 7.8525 7.7141 0.0872 32.1976 39.7292 33.5096 88.3752 20.3739 248.8130 39.9655 4.3255 53.4832 13.0367 12.3020 55.1182 23.1132 11.2873 71.9678 226.4880 25.9313 15.2747 0.4614 4.3287 10.9214 9.6328 4.9051 1.4472 6.6466 21.6083 6.0967 24.7384 7.7315
temp: 298.150 k
press: 1.00000 atm
elementType: 8 7 7 6 6 6 6 6 6 6 6 6 6 6 6 1 1 1 1 1 1 1 1 1 1
symmnumber: 1
zpe: 499972.5 jmol-1
zpe.correction: 0.190429 hartree
zpe.thermalcorrener: 0.203228 hartree
zpe.thermalcorrenthalpy: 0.204173 hartree
zpe.thermalcorrgfe: 0.150796 hartree
zpe.sumelectzpe: -646.944574 hartree
zpe.sumelectthermal: -646.931775 hartree
zpe.sumelectthermalent: -646.930831 hartree
zpe.sumelectthermalfe: -646.984208 hartree
dipole: 1.6156 -4.9846 -1.3526
dipole: 5.4117
quadrupole: -76.8927 -87.3380 -96.1302
quadrupole: 10.7248 -4.4750 -10.4796
quadrupole: 9.8942 -0.5510 -9.3432 10.7248 -4.4750 -10.4796
hfenergy: -647.1350037 hartree
pointgroup: C01 [X(C12H10N2O1)]
dipole: -0.7167734 -1.9516961 0.4586081 debye
dipolederiv: -0.8831005 0.0129836 -0.1924224 -0.5727952 -0.7277787 -0.3364379 -0.4783224 -0.1830638 -0.5647899 -1.4382718 -0.0819472 -0.3840866 -0.4335642 -0.5333355 -0.0383377 -0.7176171 -0.180904 -0.4447959 -0.1800034 0.0012465 -0.0032677 -0.0296998 -0.2402544 -0.0014837 0.0364032 0.0572621 -0.2071794 0.239573 -0.062165 0.0243213 -0.0851994 0.5533441 -0.2242736 -0.1214037 -0.1043227 0.3006279 0.0708835 0.0784423 -0.1086931 0.1829341 -0.0905482 0.023496 -0.0012265 0.0186555 -0.0701411 0.2755503 -0.1322932 -0.0265469 -0.2852851 0.0147201 -0.0319579 -0.0968111 -0.0216583 0.0176436 0.3640889 0.2216822 0.058783 0.7033582 0.2409688 0.2179875 0.4858868 0.2629615 0.0413871 -0.3352288 -0.0738854 -0.0358927 -0.0260889 -0.0300142 0.1351233 -0.2198379 0.146983 -0.1277743 -0.1108891 0.0644775 0.0283741 -0.0561268 0.0368544 0.1064209 0.016306 0.084133 -0.0717853 -0.1928076 0.0880875 0.0341708 0.0974519 0.0532946 0.1214483 0.0780943 0.0894788 -0.0924453 2.007097 -0.0559223 0.6048041 0.2592954 0.7948109 0.3712475 0.8375251 0.2708103 0.5938726 -0.0377876 -0.067948 -0.0643861 0.0235778 -0.0622155 0.0755233 -0.0057123 0.0652647 -0.0902443 0.1863056 0.0312653 -0.0205247 0.0403113 -0.0492196 0.0477301 -0.0450319 0.0531285 -0.1076605 -0.1460261 -0.0251508 0.0352318 0.0524081 -0.0603594 -0.0174301 -0.0038627 -0.008829 -0.0247676 -0.2033736 0.1841632 -0.0180606 0.2333306 -0.2148306 -0.0355327 0.0324076 -0.0713185 0.0358384 0.1502545 -0.0499878 0.0132487 0.0156562 0.0272992 0.0298336 0.0403956 -0.0123513 0.0579262 0.010543 0.0777085 0.0473138 -0.0083122 0.0498903 -0.0554649 0.0952301 -0.0713353 0.1425415 0.0495014 -0.0505575 -0.0303657 0.0025717 0.0062088 -0.1056293 0.0209055 -0.1077554 0.0894437 0.0690856 -0.0718383 -0.0379336 -0.0357388 -0.0193171 -0.0837376 -0.0013775 -0.0799112 0.1017948 0.0751617 -0.0267123 0.0059199 -0.0604316 -0.042133 -0.1024378 -0.0278797 -0.103389 0.0991463 -0.0135597 0.0619018 0.074729 0.082097 0.047091 -0.0839646 0.0705285 -0.0854636 0.0939671 -0.1234852 -0.0552313 0.0148777 -0.0630719 0.0941641 -0.0252676 0.0144097 -0.0261052 0.1378514 -0.011697 0.0046171 -0.069928 -0.0552386 0.1016407 -0.0372202 -0.1123369 -0.0101859 0.0708638 0.1138016 0.0208483 0.0019092 0.0458522 0.0842267 0.00033 0.0584845 -0.0238555 -0.0799941 0.0643841 -0.0937846 0.0484248 -0.027292 -0.0345076 0.0500351 0.0448426 0.0417714 0.0986732 unknown
polarizability: 206.4974764|-0.1979581|129.4050402|-3.2903218|17.2691777|99.9459848 unknown
InChI: InChI=1S/C12H10N2O/c1-9(15)14-7-6-10-4-2-3-5-11(10)12(14)8-13/h2-7,12H,1H3
charge 0 multiplicity 1
25 atoms
O  3.012608 0.788137 1.247821
N  1.445572 -0.387938 -0.000863
N  0.78008 2.372639 -2.031889
C  0.518517 0.77401 0.112269
C  -0.93789 0.325176 0.257984
C  -1.341258 -0.883199 -0.383728
C  1.013247 -1.506388 -0.752035
C  -0.315357 -1.73092 -0.993868
C  -1.877592 1.125239 0.935777
C  -2.712562 -1.251076 -0.349782
C  2.714623 -0.264425 0.613243
C  -3.240075 0.745364 0.967954
C  -3.655265 -0.440474 0.316426
C  0.673547 1.659268 -1.081955
C  3.669308 -1.439528 0.469786
H  0.856048 1.355841 0.990815
H  1.793104 -2.176307 -1.117938
H  -0.610399 -2.595899 -1.594227
H  -1.555438 2.052519 1.423894
H  -3.031921 -2.179408 -0.837716
H  -3.970848 1.372558 1.488865
H  -4.711117 -0.731599 0.33296
H  4.563946 -1.218815 1.069148
H  3.97938 -1.579528 -0.582546
H  3.218647 -2.383646 0.823504
