program: Gaussian 09
title: 000280096
version: EM64L-G09RevD.01
frameworkgroup: C1[X(C9H5Cl2NO)]
method: RPBEPBE
basis: SDD
operation: Freq
keyword: #p
keyword: freq=noraman
keyword: PBEPBE/SDD
title: #p freq=noraman PBEPBE/SDD
converged: NO NO NO NO
title: Mulliken charges:
elementType: Cl Cl O N C C C C C C C C C H H H H H
charge: -0.029058 -0.027281 -0.327460 -0.049005 0.209052 0.429738 -0.212622 -0.320763 -0.335413 -0.259157 -0.149916 -0.101437 -0.221297 0.324924 0.261822 0.286180 0.258057 0.263637
chargesum: 0.00000
title: Mulliken charges with hydrogens summed into heavy atoms:
elementType: Cl Cl O N C C C C C C C C C
charge: -0.029058 -0.027281 -0.327460 -0.049005 0.209052 0.429738 -0.212622 0.004161 -0.073591 0.027024 0.108141 -0.101437 0.042339
polarizability: 1.97046488e+02 -1.74972609e+00 1.60207692e+02 -4.42867640e-03 1.39660342e-02 4.57269688e+01
1716.lowfreq: -0.0013 -0.0009 0.0017 2.9149 4.5148 6.6421 78.3942 104.4283 151.4496
frequency: 78.3881 104.4276 151.4495 167.5144 223.5705 249.4294 335.4068 344.7511 355.5054 373.1202 417.2424 500.9057 507.7639 557.7815 574.2398 581.3215 639.8069 656.2469 724.9495 736.8421 813.0151 829.7724 830.4229 914.9609 918.6121 923.3914 969.2093 1042.1342 1067.2747 1128.4298 1157.3826 1195.3964 1222.7268 1247.3391 1288.7711 1358.1534 1379.3842 1419.4736 1433.4098 1505.7748 1533.7957 1576.5133 1610.2319 3158.9890 3179.7072 3182.2802 3183.1459 3214.7961
redmass: 8.0540 8.0552 20.1230 5.1489 13.8184 6.3052 12.4233 6.1077 9.8856 11.4438 3.2988 4.0594 6.9243 5.3976 3.8533 7.9231 4.6014 8.0998 6.8302 4.2532 1.4124 1.4834 6.6679 1.3599 1.3424 5.5943 1.3273 2.1183 2.5781 2.2440 1.4229 2.1516 2.3630 2.0803 2.8805 3.1101 2.8417 5.3208 2.7645 5.1675 7.1538 8.2954 7.3425 1.0882 1.0969 1.0913 1.0930 1.0958
irintensity: 0.0001 5.4103 0.0062 0.0296 0.7206 3.2047 5.5620 1.6378 3.3972 4.4160 8.5944 5.0281 2.1553 10.3626 1.0992 36.2306 3.9380 16.6759 9.1727 0.1928 49.4497 54.1717 42.8244 17.4908 6.3317 29.9508 1.0764 6.8368 38.3194 15.9540 20.9441 17.6756 32.4677 44.9857 20.1398 76.4480 23.0057 19.0984 49.8134 13.2090 34.6981 1.5289 53.4106 0.0405 0.4903 0.2533 13.6473 0.7700
temp: 298.150 k
press: 1.00000 atm
elementType: 17 17 8 7 6 6 6 6 6 6 6 6 6 1 1 1 1 1
symmnumber: 1
zpe: 308428.1 jmol-1
zpe.correction: 0.117474 hartree
zpe.thermalcorrener: 0.127863 hartree
zpe.thermalcorrenthalpy: 0.128807 hartree
zpe.thermalcorrgfe: 0.080551 hartree
zpe.sumelectzpe: -1395.109233 hartree
zpe.sumelectthermal: -1395.098845 hartree
zpe.sumelectthermalent: -1395.097900 hartree
zpe.sumelectthermalfe: -1395.146156 hartree
dipole: -2.2418 -2.1353 -0.0003
dipole: 3.0960
quadrupole: -85.6444 -91.3594 -90.7473
quadrupole: -8.4447 -0.0017 -0.0007
quadrupole: 3.6060 -2.1091 -1.4969 -8.4447 -0.0017 -0.0007
hfenergy: -1395.2267075 hartree
pointgroup: C01 [X(C9H5Cl2N1O1)]
dipole: -0.6733333 1.0150317 0.000128 debye
dipolederiv: -0.2499181 0.2220561 0.0000084 0.345252 -0.6588475 -0.0000427 0.0000058 -0.0000184 -0.0345569 -0.925447 0.0436028 -0.0000435 0.1604975 -0.1071645 0.0000042 -0.0000309 -0.0000076 -0.0514676 -0.3372954 0.2777503 0.0000062 0.1192485 -1.1185346 -0.000021 0.0000703 -0.0003424 -0.3059304 -0.0183397 -0.3457771 -0.0000579 -0.1256032 1.05781 0.0001105 -0.0001279 0.0004634 0.1024758 0.3201397 -0.1721866 -0.0000227 -0.0397397 -0.201454 -0.0000719 0.0000399 -0.00008 0.0219377 0.0169816 0.1530304 0.0000065 0.1845447 -0.245888 -0.0000233 0.0000431 -0.0000068 0.0967376 0.2649178 -0.375428 -0.0000103 -0.5982776 0.890798 0.0000545 -0.0000249 -0.0000009 -0.1127978 -0.4870973 0.1089606 -0.0000016 -0.1118572 -0.1185105 -0.0000115 -0.0000372 -0.0000063 -0.077081 -0.0071555 -0.0619932 0.0000035 0.0387637 0.0592981 0.0000149 -0.0000028 0.0000165 -0.1390679 0.035867 0.3385357 0.0001184 -0.0862817 0.0406243 0.0000007 0.000044 0.0000009 -0.1453605 -0.0682485 -0.0679786 -0.0000004 0.1815338 -0.0854582 0.0000114 0.0000002 -0.0000127 -0.0598325 1.4176456 -0.2255046 0.0000534 -0.1992322 0.1068787 0. 0.0000534 0.0000273 -0.07756 -0.2714127 0.1231708 -0.0000043 0.122825 0.0919922 0.0000249 0.0000007 0.0000141 -0.0805226 0.1371779 -0.0335163 -0.0000068 0.0621661 0.0985697 -0.0000002 0.000008 -0.0000171 0.1830626 0.0715569 0.0645648 0.0000009 0.0054289 0.0068995 -0.0000107 -0.0000115 -0.0000077 0.1602588 0.0715605 0.0068836 -0.0000207 -0.022305 0.0277812 -0.000023 -0.0000293 -0.0000323 0.1891633 -0.0042726 0.0174984 -0.0000174 0.0242635 0.1181821 -0.0000044 0.0000044 0.0000231 0.1682849 0.0333397 -0.0736692 -0.0000117 -0.0612273 0.0370236 -0.0000126 -0.0000052 -0.0000131 0.1622564 unknown
polarizability: 195.9867155|-6.4014973|161.2674648|0.0074203|0.0126334|45.7269688 unknown
InChI: InChI=1S/C9H5Cl2NO/c10-6-1-2-7-8(11)3-4-12(13)9(7)5-6/h1-5H
charge 0 multiplicity 1
18 atoms
Cl -2.462959 2.670312 0.000101
Cl 4.175399 -0.192053 0.00018
O  -0.361464 -2.937121 -0.000496
N  -0.82192 -1.689841 -0.000069
C  0.100807 -0.5912 -0.000013
C  -0.37762 0.767902 0.000059
C  -1.79427 0.98206 0.000013
C  1.484236 -0.89801 0.000002
C  0.603281 1.811236 0.000177
C  -2.172164 -1.422367 -0.000281
C  -2.671977 -0.102112 -0.00019
C  2.392471 0.159675 0.000121
C  1.969398 1.519281 0.000215
H  1.781608 -1.949607 -0.000053
H  0.26554 2.851741 0.000233
H  -2.812067 -2.305127 -0.000513
H  -3.754782 0.043226 -0.000299
H  2.712085 2.322109 0.000313
