program: Gaussian 09
title: 000280164
version: EM64L-G09RevD.01
frameworkgroup: C1[X(C27H26Si)]
method: RPBEPBE
basis: SDD
operation: Freq
keyword: #p
keyword: freq=noraman
keyword: PBEPBE/SDD
title: #p freq=noraman PBEPBE/SDD
converged: YES YES NO NO
title: Mulliken charges:
elementType: Si C C C C C C C C C C C C C C C C C C C C C C C C C C C H H H H H H H H H H H H H H H H H H H H H H H H H H
charge: 1.381271 -0.201445 -0.175481 -0.176475 -0.172514 -0.292924 -0.340211 0.543093 -0.233111 -0.470706 -0.420984 -0.325414 -0.327561 -0.327366 -0.308654 -0.308277 -0.308829 -0.249935 -0.249844 -0.250007 -0.237405 -0.237511 -0.237701 -0.693453 -0.694188 -0.233838 -0.233836 -0.233781 0.248610 0.245800 0.208162 0.231611 0.230530 0.249668 0.250041 0.250363 0.250121 0.251040 0.250496 0.228470 0.228543 0.228290 0.226355 0.226155 0.226374 0.212131 0.211741 0.227462 0.211623 0.211994 0.227459 0.227999 0.228045 0.228005
chargesum: 0.00000
title: Mulliken charges with hydrogens summed into heavy atoms:
elementType: Si C C C C C C C C C C C C C C C C C C C C C C C C C C C
charge: 1.381271 -0.201445 -0.175481 -0.176475 -0.172514 -0.044314 -0.094411 0.543093 -0.024949 -0.239095 -0.190454 -0.075746 -0.077521 -0.077003 -0.058532 -0.057237 -0.058332 -0.021465 -0.021301 -0.021717 -0.011051 -0.011356 -0.011327 -0.042119 -0.043113 -0.005838 -0.005791 -0.005776
polarizability: 3.36554168e+02 4.50722002e+00 3.02956263e+02 3.69495935e+00 1.19397361e-01 2.92852077e+02
1716.lowfreq: -0.0011 -0.0005 0.0007 2.2605 4.9085 9.7703 24.6647 29.4419 30.8826
frequency: 24.6488 29.2389 30.8548 32.8661 37.3826 44.1087 52.3215 53.1148 55.0291 60.5874 92.2490 137.9246 167.8184 178.4099 179.5016 197.8524 206.1065 217.6307 229.2018 233.6916 239.9501 249.1899 274.0825 316.2092 364.2485 392.7148 393.3707 395.3849 399.0564 419.6509 438.6098 455.7887 472.7725 497.4370 517.2458 522.8225 560.0075 607.5984 615.6523 616.4923 618.3926 635.0519 672.1642 694.6831 695.0207 707.4529 708.0410 709.4980 743.7054 748.7341 749.0748 752.9742 760.5827 840.0354 859.1775 862.3954 863.5384 867.8349 889.6182 918.8109 928.2747 929.3854 932.3117 955.1903 966.2012 980.6690 982.5215 983.5283 986.8518 987.7032 987.7703 988.2134 998.4722 999.2636 999.8297 1011.4866 1022.4645 1023.5621 1023.7903 1047.5636 1074.4549 1075.0349 1077.5444 1094.7067 1100.1314 1101.5143 1102.1269 1111.5805 1112.7757 1156.3647 1172.9120 1172.9841 1173.1489 1198.1446 1198.3287 1199.0717 1201.4866 1223.4073 1294.2955 1310.3849 1310.5793 1311.0692 1314.1053 1316.2980 1363.7160 1364.3374 1365.4823 1372.1172 1377.3715 1393.7853 1398.2511 1418.1067 1419.0048 1420.8059 1465.7460 1467.8820 1470.3292 1470.7565 1471.7544 1477.4774 1480.8620 1493.6787 1561.0152 1575.9024 1576.4062 1577.5727 1596.3354 1596.8621 1597.3528 1607.2266 2974.4515 2977.2965 2980.7500 3067.3611 3074.4570 3077.5419 3081.9337 3103.8548 3108.1997 3110.5751 3110.9402 3111.4462 3117.4303 3118.0996 3118.5573 3127.3246 3128.8977 3129.4339 3130.0726 3133.8515 3140.6780 3141.0201 3141.3872 3157.8953 3158.2334 3158.7323
redmass: 4.3984 3.0705 4.0592 3.9937 4.3129 4.3337 4.8957 4.1260 4.9197 3.6633 3.8642 4.0582 4.6834 3.7612 3.8959 1.6854 1.9815 3.7575 5.0000 2.1269 1.8338 4.8414 3.0281 2.8389 4.5366 2.7763 2.7808 2.8097 2.8439 4.2929 5.0316 4.4222 3.1741 6.1352 5.0521 4.3840 2.8396 4.0185 6.4495 6.4225 5.9290 6.8183 6.2227 6.5565 6.6502 1.8009 1.7611 1.9216 2.7398 1.8768 1.9154 1.9413 3.6405 1.5637 1.2466 1.2468 1.2472 1.2433 2.5582 1.1859 1.3569 1.3544 1.3451 1.4523 1.3219 1.4010 1.4200 1.4192 1.5700 5.2234 4.9315 4.7190 1.3107 1.3115 1.3117 3.6215 3.1982 3.0250 3.0296 1.7024 1.7282 1.7167 1.7049 2.6495 2.8044 2.8258 2.7563 1.9154 2.1199 1.7542 1.0566 1.0566 1.0565 1.1298 1.1296 1.1308 1.1364 1.8876 1.5645 1.4888 1.5489 1.3708 1.5289 1.5972 4.4634 4.7961 4.9322 2.5096 1.1981 1.5125 1.8144 2.1392 2.1373 2.1449 1.0469 1.0495 2.0228 2.0158 2.0159 1.0512 1.3317 1.5874 6.1008 5.4746 5.5194 5.5710 5.7923 5.7817 5.8044 6.0977 1.0348 1.0360 1.0835 1.1000 1.0992 1.1005 1.0996 1.0866 1.0870 1.0868 1.0867 1.0865 1.0860 1.0859 1.0862 1.0952 1.0913 1.0913 1.0914 1.0966 1.0958 1.0958 1.0959 1.1015 1.1015 1.1015
irintensity: 0.0702 0.0158 0.0181 0.0378 0.0375 0.0371 0.0368 0.0496 0.0311 0.0176 0.4134 0.1748 1.2358 0.3449 0.9318 0.3465 1.5391 0.6266 1.2706 1.0724 0.1341 0.8537 0.9346 1.6260 0.1254 0.2766 0.1298 0.2756 0.0626 6.2687 7.2325 6.8878 5.8930 45.6881 79.8867 84.7459 60.3172 18.7661 0.2586 1.0960 8.2067 1.0923 13.2378 24.2498 17.7037 81.7241 74.6235 20.6524 3.8471 11.6356 35.6544 23.3022 1.4200 28.4373 0.1561 0.0839 0.0802 0.1225 2.6200 2.7820 0.0309 0.0205 0.0144 0.0130 0.3826 0.1826 0.0234 0.0941 1.4001 1.4541 1.6937 0.4271 0.0513 0.0798 0.0720 7.6041 1.6314 3.4380 3.5134 56.9727 3.2575 1.2227 0.5815 1.4833 36.4899 38.2771 42.6121 1.4236 0.9667 0.1888 0.5582 0.3427 0.2771 6.2683 7.0424 5.8185 0.5880 4.9595 6.5530 8.5873 5.6937 3.4992 1.0366 5.5695 2.1899 1.4810 3.0183 7.4466 15.3092 2.2720 17.0295 19.0158 6.8661 22.2789 5.1434 0.6890 4.2154 11.0951 10.9099 16.8578 2.1953 23.9987 4.4189 0.6345 0.3054 1.4200 0.1015 0.1981 0.0557 14.0007 30.7074 40.9053 18.6787 1.7024 113.9584 23.6354 39.0297 12.3453 15.2511 9.9756 5.0835 1.3714 0.2014 0.1812 0.6313 37.8057 7.3389 5.4110 3.3011 7.4061 25.2024 38.7563 54.6097 52.1004 52.5640 19.7244
temp: 298.150 k
press: 1.00000 atm
elementType: 14 6 6 6 6 6 6 6 6 6 6 6 6 6 6 6 6 6 6 6 6 6 6 6 6 6 6 6 1 1 1 1 1 1 1 1 1 1 1 1 1 1 1 1 1 1 1 1 1 1 1 1 1 1
symmnumber: 1
zpe: 1157409.0 jmol-1
zpe.correction: 0.440834 hartree
zpe.thermalcorrener: 0.467125 hartree
zpe.thermalcorrenthalpy: 0.468069 hartree
zpe.thermalcorrgfe: 0.381199 hartree
zpe.sumelectzpe: -1331.932864 hartree
zpe.sumelectthermal: -1331.906573 hartree
zpe.sumelectthermalent: -1331.905629 hartree
zpe.sumelectthermalfe: -1331.992498 hartree
dipole: -0.6149 0.0202 0.0554
dipole: 0.6177
quadrupole: -158.6729 -161.9456 -162.9450
quadrupole: 0.7727 -0.0348 0.3817
quadrupole: 2.5149 -0.7577 -1.7571 0.7727 -0.0348 0.3817
hfenergy: -1332.3736979 hartree
pointgroup: C01 [X(C27H26Si1)]
dipole: -0.2419225 0.0063852 0.0221748 debye
polarizability: 336.5389115|4.3668416|302.9314286|3.9248058|0.6519751|292.892169 unknown
InChI: InChI=1S/C27H26Si/c1-22(2)23-18-20-27(21-19-23)28(24-12-6-3-7-13-24,25-14-8-4-9-15-25)26-16-10-5-11-17-26/h3-22H,1-2H3
charge 0 multiplicity 1
54 atoms
Si 0.729236 -0.015451 -0.005961
C  -1.174793 0.002647 0.164153
C  1.53442 -0.243933 1.71657
C  1.341979 1.642398 -0.74385
C  1.225106 -1.463256 -1.158019
C  -1.812618 0.275956 1.403068
C  -2.007728 -0.225176 -0.968095
C  -4.048051 0.101988 0.373667
C  -5.573441 0.15383 0.494864
C  -3.221914 0.323075 1.503891
C  -3.413981 -0.175323 -0.866502
C  1.658155 0.861569 2.604688
C  2.703836 2.033038 -0.60468
C  0.563425 -2.719796 -1.05899
C  1.98869 -1.514676 2.163644
C  0.472292 2.498377 -1.473208
C  2.275231 -1.333802 -2.10745
C  2.211264 0.703097 3.895857
C  3.182281 3.232801 -1.178849
C  0.941312 -3.81073 -1.874489
C  2.544339 -1.678366 3.453742
C  0.945555 3.700395 -2.048522
C  2.656094 -2.421589 -2.926841
C  -6.220019 -1.217187 0.159853
C  -6.179403 1.279088 -0.386358
C  2.654375 -0.569846 4.324694
C  2.303118 4.069472 -1.905267
C  1.991616 -3.664412 -2.8105
H  -1.207079 0.440196 2.302942
H  -1.551326 -0.460698 -1.938406
H  -5.815145 0.389283 1.551229
H  -3.687972 0.531806 2.475522
H  -4.021728 -0.357887 -1.761488
H  1.334053 1.858774 2.280005
H  3.394581 1.403021 -0.029384
H  -0.265461 -2.843629 -0.350088
H  1.921454 -2.382021 1.49566
H  -0.586292 2.232566 -1.581726
H  2.791763 -0.372743 -2.21933
H  2.298954 1.568966 4.562322
H  4.234481 3.514871 -1.056766
H  0.41614 -4.768542 -1.782785
H  2.892533 -2.666536 3.77616
H  0.256556 4.34776 -2.6034
H  3.465918 -2.298159 -3.655292
H  -6.018222 -1.505682 -0.888532
H  -7.317009 -1.171974 0.292956
H  -5.823137 -2.015928 0.811866
H  -5.981004 1.094655 -1.458563
H  -7.275765 1.330571 -0.250149
H  -5.750187 2.263731 -0.127749
H  3.085547 -0.695289 5.324734
H  2.670737 5.001662 -2.34977
H  2.285135 -4.507964 -3.446077
