program: Gaussian 09
title: 000280095
version: EM64L-G09RevD.01
frameworkgroup: C1[X(C17H11ClN2O)]
method: RPBEPBE
basis: SDD
operation: Freq
keyword: #p
keyword: freq=noraman
keyword: PBEPBE/SDD
title: #p freq=noraman PBEPBE/SDD
converged: YES YES NO NO
title: Mulliken charges:
elementType: Cl O N N C C C C C C C C C C C C C C C C C H H H H H H H H H H H
charge: -0.043403 -0.245390 -0.215046 0.008111 -0.279147 0.342879 0.340086 -0.175275 -0.392351 -0.398274 0.156518 -0.403166 0.262680 -0.237420 -0.230036 -0.138284 -0.331299 -0.348031 -0.096606 -0.218140 -0.220592 0.311666 0.281021 0.241337 0.247643 0.238911 0.235434 0.234219 0.294864 0.272556 0.241012 0.263522
chargesum: 0.00000
title: Mulliken charges with hydrogens summed into heavy atoms:
elementType: Cl O N N C C C C C C C C C C C C C C C C C
charge: -0.043403 -0.245390 -0.215046 0.008111 0.032519 0.342879 0.340086 0.105746 -0.151014 -0.150631 0.156518 -0.164255 0.262680 -0.001986 0.004183 -0.138284 -0.036435 -0.075474 -0.096606 0.022873 0.042930
polarizability: 3.34844796e+02 -2.09577831e+01 1.92454369e+02 -1.61677025e+01 -1.24896039e+01 1.24161461e+02
1716.lowfreq: -5.5229 0.0019 0.0022 0.0024 3.3474 10.7605 20.9622 33.5422 50.8995
frequency: 20.8973 33.4285 50.8977 79.4702 84.3281 97.1663 144.0170 165.7619 178.1427 192.3049 221.5343 255.3049 305.8438 314.6168 346.1776 366.6628 390.0023 399.8216 424.1965 430.6935 471.3643 497.1152 521.1517 534.2993 575.6640 604.8717 629.5960 640.6330 659.0950 685.2963 706.6934 730.8074 746.3389 756.4139 777.0681 792.4080 802.8225 825.5142 882.3259 900.9202 910.1006 919.9069 930.6872 937.0261 950.1610 964.3530 985.1752 985.9037 991.9487 1033.7635 1075.1109 1091.3962 1104.6300 1128.4948 1148.5203 1177.2573 1183.0214 1190.9248 1221.3850 1234.5049 1270.1677 1283.6634 1296.0917 1312.1347 1338.6045 1377.5147 1381.7444 1408.8140 1414.2309 1448.6892 1460.3757 1488.6365 1552.4044 1574.2671 1583.1552 1601.1023 1613.9476 1633.3181 2189.7261 3031.3995 3127.9302 3132.6867 3144.0766 3148.7687 3160.9429 3162.5270 3168.7469 3174.5948 3177.5630 3192.8827
redmass: 7.9609 7.1545 9.4459 4.7178 8.4100 8.5564 8.1139 7.1850 5.3548 5.6649 4.9066 5.5924 5.9048 6.0593 6.3716 5.6157 9.5311 4.3992 4.4949 3.3936 5.6113 4.9647 6.7312 5.0318 3.6655 7.6847 5.3890 5.7890 6.7168 3.5812 5.5677 2.5265 3.4813 1.4779 3.0845 1.7845 1.5531 5.0686 1.5398 4.2663 1.4756 1.4668 4.4377 1.3101 1.8791 2.6156 3.7149 1.5516 1.3418 2.2805 2.3192 1.6180 2.1099 1.6584 2.2780 1.0612 1.0938 1.7549 2.3811 1.9494 1.7800 1.4437 1.4968 3.2612 1.3355 9.2163 4.9792 2.0322 2.8650 2.4001 2.4027 2.9254 9.4807 6.7441 7.3704 6.6348 6.6985 6.6611 12.5878 1.0829 1.0867 1.0900 1.0872 1.0940 1.0915 1.0901 1.1004 1.0940 1.0982 1.0988
irintensity: 0.1199 0.1591 0.9648 1.0109 1.4029 1.2032 3.5977 2.8439 0.2651 1.8994 1.8502 2.5867 2.7038 0.5979 5.5413 1.7031 6.5099 5.8667 4.5743 2.3251 13.6816 0.9062 2.7216 2.4250 1.2887 25.3078 2.9392 5.9376 13.1685 5.4887 58.5048 93.0775 17.1032 23.4450 34.5772 95.3043 16.7501 7.5620 8.4300 30.2682 12.4111 5.6028 18.5011 5.4728 17.2322 8.5836 1.2479 0.9957 0.1684 1.5824 17.9183 5.0663 20.3738 13.0977 10.5732 0.1960 4.9730 30.6541 44.4616 52.6537 97.2240 79.0307 6.2080 417.4878 32.8865 1.3846 5.8461 9.7108 75.2257 32.9295 3.9333 18.0296 272.0321 6.9684 26.6232 2.9561 1.6740 36.8005 0.1701 6.6623 4.6021 1.4384 5.1354 20.7345 2.2823 10.2394 27.4878 0.1066 7.3290 4.1375
temp: 298.150 k
press: 1.00000 atm
elementType: 17 8 7 7 6 6 6 6 6 6 6 6 6 6 6 6 6 6 6 6 6 1 1 1 1 1 1 1 1 1 1 1
symmnumber: 1
zpe: 611630.6 jmol-1
zpe.correction: 0.232958 hartree
zpe.thermalcorrener: 0.250166 hartree
zpe.thermalcorrenthalpy: 0.251110 hartree
zpe.thermalcorrgfe: 0.186059 hartree
zpe.sumelectzpe: -1297.751556 hartree
zpe.sumelectthermal: -1297.734348 hartree
zpe.sumelectthermalent: -1297.733403 hartree
zpe.sumelectthermalfe: -1297.798454 hartree
dipole: 1.6275 -6.6716 -0.8722
dipole: 6.9224
quadrupole: -118.3667 -131.5835 -131.7274
quadrupole: -0.9844 -9.2694 -9.1755
quadrupole: 8.8591 -4.3576 -4.5015 -0.9844 -9.2694 -9.1755
hfenergy: -1297.9845134 hartree
pointgroup: C01 [X(C17H11Cl1N2O1)]
dipole: -0.47427 2.5509291 -0.8277665 debye
polarizability: 332.2313471|-27.2132192|197.8020274|16.5990714|-2.1156993|121.4272512 unknown
InChI: InChI=1S/C17H11ClN2O/c18-14-6-3-5-13(10-14)17(21)20-9-8-12-4-1-2-7-15(12)16(20)11-19/h1-10,16H
charge 0 multiplicity 1
32 atoms
Cl 6.258792 -1.071668 0.19376
O  0.978515 -2.130431 -0.745427
N  -0.159033 -0.325938 0.175382
N  -1.875062 -2.639861 2.16584
C  -1.427058 -1.094915 0.013907
C  -2.614511 -0.155568 -0.215172
C  -2.602248 1.114748 0.433519
C  -0.212874 0.849255 0.968398
C  -1.389621 1.525053 1.144963
C  -3.729408 -0.564296 -0.971614
C  1.016813 -0.938912 -0.31175
C  -3.743778 1.951532 0.321445
C  2.291165 -0.142073 -0.324728
C  -4.858835 0.280971 -1.081098
C  -4.865018 1.535883 -0.426871
C  -1.662944 -1.953524 1.214266
C  3.493722 -0.852677 -0.074176
C  2.342919 1.229316 -0.68904
C  4.716463 -0.167187 -0.152601
C  3.588607 1.887519 -0.779776
C  4.790232 1.197186 -0.500402
H  -1.276622 -1.778702 -0.841559
H  0.725803 1.162367 1.428586
H  -1.40519 2.4122 1.784022
H  -3.729019 -1.545014 -1.461443
H  -3.743584 2.93027 0.815162
H  -5.727915 -0.040478 -1.66428
H  -5.742293 2.187146 -0.503908
H  3.451154 -1.919447 0.1621
H  1.42307 1.771351 -0.92955
H  3.63036 2.9412 -1.073868
H  5.7582 1.702888 -0.561885
