program: Gaussian 09
title: 000280101
version: EM64L-G09RevD.01
frameworkgroup: C1[X(C17H13ClN2O3S)]
method: RPBEPBE
basis: SDD
operation: Freq
keyword: #p
keyword: freq=noraman
keyword: PBEPBE/SDD
title: #p freq=noraman PBEPBE/SDD
converged: YES YES NO NO
title: Mulliken charges:
elementType: Cl S O O O N N C C C C C C C C C C C C C C C C C H H H H H H H H H H H H H
charge: -0.033404 0.857934 -0.530282 -0.527089 -0.245455 -0.016434 -0.446356 -0.072465 0.362770 -0.084443 -0.032029 -0.202153 -0.226759 -0.203181 -0.343383 0.509126 -0.340001 -0.431868 -0.276133 -0.362368 -0.239645 -0.102851 0.223628 -0.795940 0.294191 0.264988 0.280093 0.281273 0.320681 0.232913 0.292941 0.255132 0.264066 0.316275 0.241779 0.274355 0.240091
chargesum: 0.00000
title: Mulliken charges with hydrogens summed into heavy atoms:
elementType: Cl S O O O N N C C C C C C C C C C C C C C C C C
charge: -0.033404 0.857934 -0.530282 -0.527089 -0.245455 -0.016434 -0.130080 -0.072465 0.362770 -0.084443 -0.032029 0.092038 0.038229 0.076912 -0.062110 0.509126 -0.019320 -0.198954 0.016808 -0.107235 0.024421 -0.102851 0.223628 -0.039715
polarizability: 3.01275966e+02 8.54399513e+00 2.77405835e+02 -1.38931182e+00 -4.00417218e+01 1.90329231e+02
1716.lowfreq: -59.9405 -7.6602 -3.1063 -0.0017 -0.0011 -0.0008 2.6087 15.2586 21.1527
frequency: -59.9328 15.0436 21.0836 35.6461 59.4921 75.7713 84.2172 100.8115 117.9258 128.5630 156.7097 177.8333 198.1763 207.0740 220.7786 233.4067 251.8308 265.2384 308.6089 324.2762 343.5456 360.2104 385.4943 402.8892 412.0823 428.5190 452.2448 464.2642 501.7538 524.6730 534.5520 552.6024 583.5717 585.8695 600.0640 618.8794 634.6580 647.6442 648.9380 674.6689 728.3598 770.9289 777.7477 785.6743 817.5843 833.8936 837.7243 850.3819 864.7230 868.7398 897.9302 913.1576 924.7857 930.9865 959.3482 971.2191 975.2576 982.7987 990.0903 994.5826 1033.8807 1051.1308 1053.3284 1062.3672 1121.6528 1132.6764 1181.3184 1185.3830 1201.8685 1217.7611 1252.8929 1265.2045 1294.0846 1330.8127 1341.8407 1365.3451 1368.7998 1379.6727 1405.6310 1407.0093 1420.9065 1446.9068 1468.6886 1472.4213 1475.8928 1505.0138 1534.7666 1582.5890 1595.6495 1600.7784 1611.0421 1641.4743 2990.0488 3074.9735 3124.4055 3138.6120 3140.0074 3151.9584 3160.0899 3160.8670 3163.3429 3175.8560 3185.8490 3197.4832 3521.5295
redmass: 1.0621 8.2292 6.0372 5.3126 5.0257 4.6171 6.8458 7.1929 12.0647 5.2545 5.3732 6.5407 10.6692 6.7511 12.1571 6.6509 7.4109 6.0682 8.2459 6.0921 5.7265 7.5877 6.5136 5.6495 3.0049 4.1253 5.4703 7.2599 3.4441 3.4853 4.9504 4.8573 2.9107 6.4807 8.1242 6.9819 3.9231 6.2617 1.2328 6.1803 3.3904 7.5762 2.9635 10.3206 4.5001 1.4135 1.6263 6.6397 1.3344 1.3760 1.5269 7.9759 7.5349 7.4671 1.3843 1.4183 1.3399 2.1867 2.8134 1.3366 1.6711 2.1789 2.3362 2.2198 1.3177 2.1302 1.4592 1.2561 2.2026 3.4103 1.4160 1.8998 1.4170 3.6016 2.7294 2.5820 3.9508 1.2490 5.0587 3.8104 2.5943 1.1325 1.0463 3.3451 2.2548 2.0514 9.0317 7.1386 6.4622 5.6448 7.6763 5.1662 1.0386 1.0983 1.0900 1.0896 1.0979 1.0901 1.0905 1.0953 1.0950 1.0966 1.0937 1.0952 1.0765
irintensity: 0.0712 0.9272 1.8576 3.1482 1.1994 5.7792 1.0224 1.5044 2.7931 4.5676 0.9197 5.0021 3.6930 4.6227 4.5452 0.6120 1.4936 1.0238 4.0340 7.1871 25.4667 5.5768 2.6838 2.9303 0.2059 18.1119 12.1878 95.1783 1.7620 51.4754 31.5912 55.8940 2.8227 36.4189 17.8215 5.0808 6.0607 3.4262 64.8641 4.2421 1.6185 24.8775 0.2958 64.1823 5.7810 33.5628 49.4576 57.9603 20.4778 45.7260 30.3517 62.9028 4.6677 9.2063 2.9088 0.9443 3.6753 20.3466 9.0453 3.2526 8.2722 25.6681 29.0020 26.9263 8.7212 7.4106 34.6421 15.2809 36.2981 71.2525 4.0125 60.6240 52.0289 25.1574 9.3443 1.8781 239.7872 77.4189 13.0449 58.4807 19.6669 43.6772 20.8660 77.5797 48.2047 420.1136 41.4372 25.7604 103.5162 24.6705 46.8257 111.1397 6.0879 12.3512 14.9779 19.1997 5.6338 4.7118 1.0345 12.0546 5.3975 1.7723 0.9513 9.6968 15.8451
temp: 298.150 k
press: 1.00000 atm
elementType: 17 16 8 8 8 7 7 6 6 6 6 6 6 6 6 6 6 6 6 6 6 6 6 6 1 1 1 1 1 1 1 1 1 1 1 1 1
symmnumber: 1
zpe: 689104.9 jmol-1
zpe.correction: 0.262466 hartree
zpe.thermalcorrener: 0.283605 hartree
zpe.thermalcorrenthalpy: 0.284550 hartree
zpe.thermalcorrgfe: 0.209954 hartree
zpe.sumelectzpe: -1847.075295 hartree
zpe.sumelectthermal: -1847.054156 hartree
zpe.sumelectthermalent: -1847.053211 hartree
zpe.sumelectthermalfe: -1847.127807 hartree
dipole: -5.8178 0.8018 5.5088
dipole: 8.0521
quadrupole: -127.1878 -171.3045 -156.7730
quadrupole: 1.9382 -19.2647 -13.2534
quadrupole: 24.5673 -19.5494 -5.0179 1.9382 -19.2647 -13.2534
hfenergy: -1847.337761 hartree
pointgroup: C01 [X(C17H13Cl1N2O3S1)]
dipole: 2.2187745 -0.066751 -2.2601785 debye
polarizability: 298.4087558|-10.0357564|281.7276872|0.3097022|38.7907847|188.8745888 unknown
InChI: InChI=1S/C17H13ClN2O3S/c1-11(21)20-13-3-5-14(6-4-13)24(22,23)17-8-9-19-16-10-12(18)2-7-15(16)17/h2-10,20H,1H3
charge 0 multiplicity 1
37 atoms
Cl -4.292723 4.383124 0.338844
S  -0.621937 -1.970584 1.219133
O  -0.627066 -3.574159 0.882007
O  -0.835627 -1.396549 2.737499
O  5.148759 2.013041 0.389326
N  -3.860703 -0.306504 -1.832798
N  4.732976 0.064907 -0.855775
C  -1.957424 -1.209696 0.045581
C  -2.466626 0.114019 0.20687
C  1.015837 -1.291561 0.571688
C  -3.43279 0.526542 -0.807565
C  -2.391539 -2.061451 -0.95763
C  1.557315 -0.137701 1.157976
C  1.67271 -2.019101 -0.434829
C  -2.120525 1.033402 1.25151
C  3.480735 -0.355042 -0.339811
C  2.800142 0.342927 0.697923
C  2.911878 -1.538455 -0.89345
C  -3.985332 1.845804 -0.756947
C  -3.360934 -1.553578 -1.885003
C  -2.676986 2.312503 1.281535
C  -3.598441 2.703812 0.266007
C  5.501994 1.184671 -0.495583
C  6.808816 1.304485 -1.276539
H  -2.013329 -3.086726 -1.022654
H  1.037347 0.363622 1.980473
H  1.238568 -2.945649 -0.823611
H  -1.454091 0.705671 2.054863
H  3.252528 1.237799 1.127495
H  3.445879 -2.088538 -1.678126
H  -4.7025 2.133502 -1.529247
H  -3.728684 -2.193987 -2.694303
H  -2.422074 3.012096 2.082442
H  5.128309 -0.530157 -1.588369
H  7.460596 0.427969 -1.104247
H  7.336576 2.207561 -0.939352
H  6.622666 1.38688 -2.363438
