program: Gaussian 09
title: 000280065
version: EM64L-G09RevD.01
frameworkgroup: C1[X(C10H10N2O3)]
method: RPBEPBE
basis: SDD
operation: Freq
keyword: #p
keyword: freq=noraman
keyword: PBEPBE/SDD
title: #p freq=noraman PBEPBE/SDD
converged: NO YES NO YES
title: Mulliken charges:
elementType: O O O N N C C C C C C C C C C H H H H H H H H H H
charge: -0.216794 -0.250365 -0.236078 -0.213109 -0.403643 0.166657 -0.469743 0.157222 0.092891 -0.430080 0.014653 0.377746 0.245838 -0.791255 -0.739543 0.282755 0.282777 0.274296 0.338193 0.246569 0.246576 0.256762 0.250939 0.258351 0.258386
chargesum: 0.00000
title: Mulliken charges with hydrogens summed into heavy atoms:
elementType: O O O N N C C C C C C C C C C
charge: -0.216794 -0.250365 -0.236078 -0.213109 -0.065451 0.166657 0.095789 0.157222 0.092891 -0.155784 0.014653 0.377746 0.245838 -0.041348 0.028133
polarizability: 1.80981174e+02 7.27109860e+00 1.54681156e+02 -3.95822507e-03 -6.09148090e-03 6.53494059e+01
1716.lowfreq: -0.0007 -0.0005 -0.0004 1.7666 5.5268 9.0540 57.1763 74.7114 101.8259
frequency: 57.1635 74.6808 101.8100 118.0986 137.0652 140.2918 160.3685 187.6082 252.8202 265.1080 271.4571 311.9952 322.6807 357.3847 427.7994 474.7960 486.6405 555.0709 577.1835 582.8729 601.0767 606.9743 693.8520 695.6594 761.4807 776.5944 786.0806 795.4022 857.7630 955.3305 972.5238 979.2670 990.5391 1040.8287 1047.2005 1051.7735 1090.4633 1113.9399 1147.9469 1148.3590 1192.2751 1241.0611 1286.4301 1318.0138 1352.2885 1392.4248 1405.3508 1407.3009 1429.8160 1436.6533 1448.2096 1455.1222 1467.4989 1475.6029 1582.6272 1610.0270 1613.7607 1643.0648 1659.8118 2982.9717 3008.4905 3013.5696 3059.2326 3060.1115 3094.1740 3115.9254 3138.7116 3195.3609 3496.0879
redmass: 5.1544 4.0973 1.0818 8.2317 1.0891 5.6293 2.9776 4.9848 5.1816 4.0445 4.7135 2.6224 3.9391 11.1388 4.6131 5.1345 4.9829 7.9178 4.8727 2.9150 3.8552 5.1033 5.0709 2.5136 3.6887 1.8881 7.1834 4.7334 1.3915 2.7047 1.8967 2.4775 2.3094 1.7037 3.0734 1.5222 2.4517 4.3401 6.7688 1.0952 1.7200 3.1930 3.0984 2.7770 2.3791 1.2391 2.0373 1.5557 1.1032 3.9135 1.0455 1.0936 1.0430 1.1779 7.8144 7.7358 5.1072 12.0230 7.8856 1.0390 1.0366 1.0600 1.0980 1.1023 1.0960 1.0972 1.1024 1.0941 1.0770
irintensity: 1.6417 1.6400 0.4150 12.8131 0.4875 0.0621 1.6173 0.9314 16.3968 1.0793 13.8508 2.3467 2.5690 1.0353 0.3822 3.7394 6.9513 3.8233 11.3302 3.9188 0.0318 13.6072 3.3617 5.4962 31.6721 69.0094 13.6231 2.9328 21.0091 30.8917 0.0026 3.0148 0.3134 8.2600 2.7615 11.8458 0.4764 72.9622 53.6013 0.6621 16.8696 33.8674 226.7179 338.8736 4.5988 63.6059 38.1727 11.7512 32.6440 12.3076 18.3842 28.8009 17.5744 13.5430 47.8582 61.8479 228.0106 390.6975 328.8285 22.9301 0.7481 0.9740 11.4425 2.8572 4.7747 8.8093 15.7707 5.2301 46.4968
temp: 298.150 k
press: 1.00000 atm
elementType: 8 8 8 7 7 6 6 6 6 6 6 6 6 6 6 1 1 1 1 1 1 1 1 1 1
symmnumber: 1
zpe: 493806.1 jmol-1
zpe.correction: 0.188081 hartree
zpe.thermalcorrener: 0.201756 hartree
zpe.thermalcorrenthalpy: 0.202700 hartree
zpe.thermalcorrgfe: 0.147648 hartree
zpe.sumelectzpe: -721.208021 hartree
zpe.sumelectthermal: -721.194346 hartree
zpe.sumelectthermalent: -721.193402 hartree
zpe.sumelectthermalfe: -721.248455 hartree
dipole: -4.9790 -3.5254 -0.0004
dipole: 6.1007
quadrupole: -72.8613 -104.6311 -85.6173
quadrupole: 3.3550 -0.0065 -0.0016
quadrupole: 14.8419 -16.9279 2.0859 3.3550 -0.0065 -0.0016
hfenergy: -721.3961023 hartree
pointgroup: C01 [X(C10H10N2O3)]
dipole: -1.9733677 1.366314 0.0001605 debye
dipolederiv: -0.6590201 -0.2685018 -0.0000456 -0.0081975 -1.0587924 -0.0001621 0.0000136 0.0003361 -0.3018584 -0.4773404 -0.2175476 0.0000144 -0.1022164 -1.3431434 0.0000518 -0.0000167 0.0000902 -0.3665358 -0.9363335 0.1381381 0.0000523 0.4556358 -0.8095016 0.0000006 0.0003515 -0.0001574 -0.3287568 -1.8562948 0.4338501 0.0002287 0.2957668 -0.6772093 0.0000233 0.0002171 -0.0000588 -0.1924755 -0.4645733 0.4639619 -0.0000501 -0.2686902 -0.6212078 -0.0000004 -0.0000005 0.0000922 -0.2731833 -0.0839148 -0.5545776 0.0000934 0.0160286 -0.3776209 0.0000785 -0.0000654 -0.0000979 -0.060626 0.1411733 0.1681279 -0.000025 0.2894692 0.0422883 -0.0000577 -0.0000096 -0.0000674 0.2707043 0.0560321 -0.4825999 0.0001068 -0.449592 0.1917964 -0.0000595 -0.0001119 -0.000061 0.0310579 1.3687205 0.2262361 0.0000254 -0.2335171 1.4762636 0.0001415 0.0001665 -0.0002464 0.1952804 -0.7127797 0.3721913 -0.0000955 -0.1738076 -0.1140344 -0.0000177 -0.0001068 0.0000599 -0.1977204 0.4989091 0.2184573 -0.0000045 0.1115864 1.7141596 -0.000107 0.0000931 -0.0000943 0.1835326 0.7354691 -0.2347032 0.0001295 0.5004095 0.3125366 0.0000508 0.0001242 -0.0001087 0.0471961 2.171252 -0.2845737 -0.0003652 -0.2015973 0.9564899 -0.0000205 -0.000691 0.0000871 0.1923567 -0.1595133 0.1143033 -0.0000462 -0.007022 -0.0035493 0.0000036 -0.0000808 0.0000517 0.0675445 -0.1338488 -0.1452333 0.0000207 -0.2732867 -0.3099958 0.0001106 0.0001913 0.0001958 0.0157376 0.0298674 0.0162604 -0.0284616 -0.0414269 0.0648479 0.0436555 -0.0260038 0.0561483 0.0158218 0.029931 0.016282 0.0284578 -0.0414122 0.0648668 -0.0436311 0.0259967 -0.0560831 0.0159134 0.1080564 0.0062517 -0.0000166 0.0505617 0.0090715 0.000013 -0.0000269 0.0000152 0.1788082 0.196695 0.0068362 -0.0000183 0.0071937 0.1696285 0.0000064 -0.000024 0.0000133 0.3031853 -0.0176119 0.0159557 0.068069 -0.0150717 0.0769502 0.0765322 0.1224261 0.0368447 -0.0216793 -0.0175498 0.0159806 -0.0680636 -0.0150344 0.07695 -0.0765327 -0.1224132 -0.036843 -0.0217501 0.0902844 -0.0773463 -0.0000068 0.0256758 -0.0872864 0.0000034 -0.0000033 -0.0000141 0.124835 -0.1124847 0.0051421 0.0000749 0.0801182 0.0909985 -0.0000372 0.0000922 -0.0000102 0.1240704 0.1024779 0.0235415 0.0669904 -0.0008048 0.0777205 -0.0576995 0.044117 -0.0585179 -0.0007964 0.102397 0.023567 -0.0670643 -0.0007688 0.0777732 0.0576544 -0.0442352 0.0584257 -0.0006621 unknown
polarizability: 181.1312975|-6.9927175|154.5310328|0.0040221|-0.0060495|65.3494059 unknown
InChI: InChI=1S/C10H10N2O3/c1-5-3-7-8(9(14)11-5)4-12(6(2)13)10(7)15/h3,11H,4H2,1-2H3
charge 0 multiplicity 1
25 atoms
O  1.370776 2.297364 -0.000294
O  -1.837593 -2.782719 -0.000118
O  3.698922 -1.346107 -0.000757
N  1.7678 -0.080192 0.000085
N  -2.846012 -0.657031 -0.000482
C  -0.460203 -0.764396 -0.000051
C  0.93898 -1.317893 0.000205
C  -0.450701 0.624763 -0.000122
C  0.964829 1.106116 0.000269
C  -1.638978 1.415289 -0.000423
C  -1.697191 -1.520473 -0.000269
C  -2.853968 0.736048 -0.000586
C  3.186918 -0.193136 -0.00021
C  -4.20649 1.407926 -0.000863
C  3.998273 1.085526 -0.00068
H  1.163814 -1.93916 0.886058
H  1.163995 -1.939416 -0.885423
H  -1.596008 2.50531 -0.000453
H  -3.739859 -1.161811 -0.00059
H  -4.79604 1.127099 0.892306
H  -4.79567 1.127095 -0.894276
H  -4.091117 2.502384 -0.000842
H  5.063514 0.811616 -0.001164
H  3.762758 1.708149 0.879543
H  3.761949 1.708049 -0.880762
