program: Gaussian 09
title: 000280045
version: EM64L-G09RevD.01
frameworkgroup: C1[X(C10H20N2O2)]
method: RPBEPBE
basis: SDD
operation: Freq
keyword: #p
keyword: freq=noraman
keyword: PBEPBE/SDD
title: #p freq=noraman PBEPBE/SDD
converged: YES YES NO NO
title: Mulliken charges:
elementType: O O N N C C C C C C C C C C H H H H H H H H H H H H H H H H H H H H
charge: -0.280930 -0.280946 -0.372659 -0.372638 -0.373774 -0.373796 -0.506761 -0.506792 -0.348191 -0.348173 0.252205 0.252232 -0.682341 -0.682352 0.258353 0.245410 0.245411 0.258363 0.197530 0.229526 0.197561 0.229518 0.303599 0.303601 0.195384 0.243376 0.195397 0.243383 0.211462 0.205712 0.222087 0.211441 0.205706 0.222093
chargesum: 0.00000
title: Mulliken charges with hydrogens summed into heavy atoms:
elementType: O O N N C C C C C C C C C C
charge: -0.280930 -0.280946 -0.069060 -0.069038 0.129989 0.129978 -0.079706 -0.079714 0.090570 0.090608 0.252205 0.252232 -0.043079 -0.043111
polarizability: 1.50113883e+02 3.71802711e-04 1.27105852e+02 9.93953320e+00 -1.37272073e-03 1.07125432e+02
1716.lowfreq: -8.3574 -0.0004 -0.0001 0.0006 3.5808 11.5627 12.3440 27.2574 37.6990
frequency: 11.0277 27.2549 37.6986 48.5929 56.2746 71.2281 81.4955 108.4207 110.8684 182.0326 185.5288 230.1565 230.3535 251.9870 266.4240 300.5680 320.2362 335.4296 399.4292 412.7564 480.0758 527.0247 570.6756 605.5477 629.9297 697.5526 717.7672 744.4950 745.8893 830.6410 850.6414 868.4674 869.2366 882.6932 888.4503 920.6773 946.4183 1053.6247 1057.5178 1058.0932 1065.8275 1096.9831 1097.5878 1105.6097 1119.0342 1129.9033 1207.2020 1214.6756 1237.0531 1245.1005 1253.0570 1276.8378 1276.8754 1292.2307 1311.6297 1313.8704 1340.2951 1349.4415 1349.5758 1366.1547 1390.9094 1390.9407 1444.2707 1446.1195 1447.5469 1447.7443 1475.3018 1475.4414 1477.4068 1477.4853 1486.2533 1486.2952 1489.7970 1490.9376 1609.8981 1611.4647 2970.9480 2971.0125 2973.4659 2973.5184 2988.1766 2988.3211 3009.5482 3019.0650 3025.1617 3025.2888 3048.0788 3048.1468 3074.4168 3074.4528 3075.2591 3075.5407 3086.8568 3104.3035 3564.1495 3564.3590
redmass: 3.7883 2.5836 5.8794 4.2863 1.7865 3.0429 2.2618 3.1258 3.5226 3.7567 3.4684 1.0980 1.0981 2.8072 3.1483 4.3937 3.5375 2.6865 3.1028 2.8104 1.7191 1.5180 1.4105 2.2029 2.5645 3.6908 3.3793 1.1930 1.2590 2.5853 2.1140 2.2952 1.3387 1.8582 1.9667 2.2399 2.6411 2.2413 2.6232 2.5028 1.8871 1.8362 1.9909 2.2700 2.3927 2.8068 1.5812 1.5535 1.3068 1.4714 1.3106 1.2216 1.2213 1.1356 1.3465 1.3449 1.2453 1.5692 1.5800 1.2720 1.2151 1.2149 1.2832 1.1128 1.1513 1.1880 1.0478 1.0470 1.0473 1.0472 1.0810 1.0813 1.6207 1.7100 6.2307 5.7016 1.0423 1.0426 1.0525 1.0524 1.0645 1.0645 1.0620 1.0627 1.0973 1.0971 1.1001 1.1001 1.0990 1.0990 1.1017 1.1017 1.1022 1.1019 1.0785 1.0782
irintensity: 0.5520 0.9145 4.9820 15.6092 0.0203 0.3217 6.3702 2.6830 0.0004 11.6645 4.2522 0.0707 0.0615 0.3648 19.6921 2.7031 2.8511 0.1766 7.7928 4.1853 60.0099 135.0555 26.8895 9.5682 7.4376 1.3214 4.6057 5.0933 12.9536 10.3296 3.9084 2.9467 0.7182 0.0051 19.3543 0.8211 8.5339 2.7609 0.0858 5.3110 0.3722 12.0978 9.1557 1.9427 4.4001 0.6461 60.2694 8.5030 14.8305 7.8896 44.8379 17.3569 13.1958 4.2932 14.7168 19.6005 14.5092 6.0058 20.4129 21.6092 10.9529 9.1886 1.7403 23.3540 7.0319 121.5222 10.8559 0.1800 6.2698 13.4964 14.9820 17.7624 68.1172 314.9873 231.5709 66.6452 29.1275 19.8396 34.6127 24.9309 0.6406 64.8671 11.5840 38.5917 18.5348 10.9774 0.2671 0.0323 14.2995 77.3369 106.5380 51.0524 4.3875 8.7010 29.1584 3.5009
temp: 298.150 k
press: 1.00000 atm
elementType: 8 8 7 7 6 6 6 6 6 6 6 6 6 6 1 1 1 1 1 1 1 1 1 1 1 1 1 1 1 1 1 1 1 1
symmnumber: 1
zpe: 775000.8 jmol-1
zpe.correction: 0.295182 hartree
zpe.thermalcorrener: 0.312575 hartree
zpe.thermalcorrenthalpy: 0.313519 hartree
zpe.thermalcorrgfe: 0.246153 hartree
zpe.sumelectzpe: -651.911894 hartree
zpe.sumelectthermal: -651.894501 hartree
zpe.sumelectthermalent: -651.893557 hartree
zpe.sumelectthermalfe: -651.960923 hartree
dipole: -0.0005 3.9603 0.0004
dipole: 3.9603
quadrupole: -97.4479 -90.1477 -83.3566
quadrupole: -0.0025 -9.7092 -0.0011
quadrupole: -7.1305 0.1697 6.9608 -0.0025 -9.7092 -0.0011
hfenergy: -652.207076 hartree
pointgroup: C01 [X(C10H20N2O2)]
dipole: -0.0004315 1.5581193 -0.0013473 debye
polarizability: 150.7818269|0.011901|127.1058323|8.3447064|-0.0203619|106.4575069 unknown
InChI: InChI=1S/C10H20N2O2/c1-3-5-9(13)11-7-8-12-10(14)6-4-2/h11-12H,3-8H2,1-2H3
charge 0 multiplicity 1
34 atoms
O  -2.850413 -1.43533 -0.459117
O  2.850565 -1.433324 0.462246
N  -1.158408 -0.760466 0.976847
N  1.158313 -0.762054 -0.975114
C  -0.313736 -1.936125 0.710185
C  0.314099 -1.937479 -0.706017
C  -3.188809 0.645143 0.814597
C  3.187933 0.644917 -0.815455
C  -3.825148 1.380232 -0.389904
C  3.825396 1.381337 0.387613
C  -2.397449 -0.594596 0.381684
C  2.397446 -0.594689 -0.380568
C  -4.769778 2.517502 0.050378
C  4.768929 2.518679 -0.054826
H  0.49156 -1.970146 1.461884
H  -0.930553 -2.849355 0.802714
H  0.931304 -2.850634 -0.796642
H  -0.491167 -1.973382 -1.457658
H  -2.556693 1.340472 1.402406
H  -4.000541 0.302656 1.487723
H  2.554929 1.339495 -1.40321
H  3.998988 0.302081 -1.489222
H  -0.820123 -0.048831 1.624959
H  0.819475 -0.051581 -1.624212
H  -3.023574 1.786161 -1.038454
H  -4.372143 0.634333 -0.994775
H  3.024423 1.787428 1.0368
H  4.373465 0.636225 0.992477
H  -5.598967 2.124804 0.668914
H  -4.235758 3.279875 0.649099
H  -5.214258 3.026838 -0.823908
H  5.597461 2.125874 -0.674187
H  4.233763 3.280347 -0.653418
H  5.214368 3.02889 0.818459
