program: Gaussian 09
title: 000280100
version: EM64L-G09RevD.01
frameworkgroup: C1[X(C24H15Cl2NO3)]
method: RPBEPBE
basis: SDD
operation: Freq
keyword: #p
keyword: freq=noraman
keyword: PBEPBE/SDD
title: #p freq=noraman PBEPBE/SDD
converged: YES YES NO NO
title: Mulliken charges:
elementType: Cl Cl O O O N C C C C C C C C C C C C C C C C C C C C C C C C H H H H H H H H H H H H H H H
charge: -0.028498 -0.027717 -0.322027 -0.200525 -0.173753 0.032321 -0.222654 0.382880 0.111546 0.291705 0.488795 -0.416269 -0.392093 -0.096153 -0.087739 0.231308 -0.195922 -0.227531 -0.219620 -0.223084 -0.357153 -0.316773 -0.343271 -0.270758 -0.243152 -0.220681 -0.112574 -0.228446 -0.246604 -0.223806 0.289014 0.260125 0.269546 0.279066 0.228765 0.231398 0.274994 0.257903 0.263846 0.302279 0.232061 0.264528 0.236222 0.233638 0.234867
chargesum: 0.00000
title: Mulliken charges with hydrogens summed into heavy atoms:
elementType: Cl Cl O O O N C C C C C C C C C C C C C C C C C C C C C C C C
charge: -0.028498 -0.027717 -0.322027 -0.200525 -0.173753 0.032321 0.066359 0.382880 0.111546 0.291705 0.488795 -0.156144 -0.122548 -0.096153 -0.087739 0.231308 -0.195922 0.051535 0.009145 0.008313 -0.082159 -0.058871 -0.079425 0.031520 -0.011091 0.043847 -0.112574 0.007776 -0.012966 0.011061
polarizability: 4.10580042e+02 2.08542839e+01 2.58443105e+02 1.27504513e+01 -4.16737574e+01 2.54350628e+02
1716.lowfreq: -10.8565 -9.5422 -5.1563 -3.5259 -0.0022 -0.0017 -0.0015 12.6880 16.9339
frequency: -9.5406 12.3210 16.7264 22.9706 34.2800 40.1238 47.7159 74.9558 85.4648 100.6302 106.7197 130.6845 148.2562 157.8757 170.0269 202.4891 212.7000 241.1388 252.6260 259.8013 269.9086 289.0143 319.9126 345.0118 373.7421 390.6954 398.8256 401.3963 418.6907 429.2954 437.4474 466.4010 493.3789 528.0093 550.6454 570.8697 594.2252 598.3037 612.2202 613.0128 616.3669 626.6661 637.1687 680.0476 687.7348 695.3362 704.2537 719.7295 741.2662 760.8193 768.1210 773.7297 788.0174 819.9940 834.2149 854.6937 860.2320 872.0271 891.7305 892.8261 901.3348 933.6278 942.3310 945.8136 969.5679 971.0628 984.9543 986.4426 989.5165 989.9684 1000.1513 1006.3826 1012.9617 1029.1415 1040.9787 1054.2906 1068.8450 1087.6578 1089.2198 1133.5881 1170.8153 1174.6134 1175.6079 1189.4748 1193.3481 1195.8595 1226.2521 1238.4016 1244.6471 1257.3631 1271.8050 1304.7349 1322.9062 1324.4004 1337.4405 1374.5466 1381.3818 1386.6872 1395.3222 1423.4592 1435.3982 1435.6849 1477.5929 1478.6860 1481.9553 1531.3040 1567.4235 1572.0633 1590.6277 1593.0506 1607.5597 1609.1529 1613.7990 1653.7366 3019.1762 3127.4577 3131.1421 3135.5647 3142.9858 3147.7643 3155.4386 3157.7592 3161.2858 3166.6713 3172.0857 3175.5737 3179.2926 3186.3917 3207.7862
redmass: 10.1036 6.1207 4.4142 7.5709 6.7850 6.7895 4.5141 11.1645 5.9599 9.4589 7.9726 7.2668 7.4461 7.0700 5.8344 8.1244 6.8945 6.9739 7.1413 5.7842 8.5967 7.6467 11.9528 9.9667 11.9620 6.5190 2.8412 2.8908 4.9230 3.5761 4.6017 4.1174 6.3212 5.7454 6.3817 5.5824 8.1188 5.8475 6.5514 6.6679 6.4814 5.1575 6.3643 7.0862 5.1001 1.7315 2.5959 2.1186 5.7872 5.9550 1.9899 2.9240 2.7791 7.5113 1.6876 1.2589 1.2445 3.6498 2.1356 2.6914 1.4971 1.6348 2.0538 2.6503 1.3296 6.8524 1.4547 1.4579 6.0601 4.4034 1.3474 1.3567 4.1224 2.1698 2.3243 2.2982 4.2936 1.5949 1.6257 1.7992 1.3375 1.1113 1.0583 1.2432 1.2300 1.5432 2.4960 2.6326 1.6849 3.7916 2.2881 1.4280 1.3238 1.3013 4.0780 4.0672 7.7120 8.7558 4.4007 5.2604 2.2559 2.2467 3.7307 2.2201 2.2499 10.0043 7.6396 8.6063 6.2913 6.8718 7.4849 6.0121 6.2136 12.4274 1.0837 1.0850 1.0855 1.0886 1.0890 1.0938 1.0935 1.0883 1.0966 1.0967 1.0987 1.0988 1.0973 1.0939 1.0933
irintensity: 0.1506 0.0797 0.3028 1.2892 0.3289 0.8700 0.0698 0.3907 0.0665 0.7586 0.5836 0.4641 1.3012 0.8601 0.7052 0.7602 2.5870 2.6096 6.4248 1.6394 5.7786 3.5838 0.8483 1.9635 12.2346 0.8981 0.3462 0.0750 0.9445 10.5012 5.7836 5.1043 9.5254 7.3232 12.0383 0.1373 14.4463 33.8651 6.2849 7.5061 3.6637 11.6007 47.8009 18.6827 5.3140 69.8161 26.1185 64.7822 17.9058 14.8189 31.9606 0.6342 21.8833 22.5432 44.8375 1.2781 0.3684 15.1876 10.7657 14.6790 24.7604 7.6582 23.1126 16.1976 0.8206 117.1646 0.3455 0.8607 1.7559 0.1084 0.0784 1.0163 16.2886 10.5357 10.9718 68.1192 472.6114 9.1697 1.6723 142.6219 92.1508 22.4432 0.5425 25.3359 7.1533 3.4253 56.0109 11.8279 24.8681 29.1256 73.1057 23.2947 2.3670 0.2622 0.7962 0.1904 0.2500 2.2492 78.1881 47.1133 23.8822 4.7949 74.7629 3.6697 25.3305 42.5582 107.9668 27.3832 10.8498 32.3570 87.1763 16.5656 7.5356 127.0484 3.5382 0.3345 0.2102 5.3437 8.4811 14.2312 11.4173 0.4041 33.0213 23.5968 10.6026 9.8576 1.8104 2.4964 2.8812
temp: 298.150 k
press: 1.00000 atm
elementType: 17 17 8 8 8 7 6 6 6 6 6 6 6 6 6 6 6 6 6 6 6 6 6 6 6 6 6 6 6 6 1 1 1 1 1 1 1 1 1 1 1 1 1 1 1
symmnumber: 1
zpe: 845070.8 jmol-1
zpe.correction: 0.321870 hartree
zpe.thermalcorrener: 0.346496 hartree
zpe.thermalcorrenthalpy: 0.347441 hartree
zpe.thermalcorrgfe: 0.263286 hartree
zpe.sumelectzpe: -2122.048602 hartree
zpe.sumelectthermal: -2122.023976 hartree
zpe.sumelectthermalent: -2122.023032 hartree
zpe.sumelectthermalfe: -2122.107187 hartree
dipole: 0.4862 -2.6895 5.3690
dipole: 6.0246
quadrupole: -175.9803 -177.5290 -188.6370
quadrupole: 1.6502 1.1579 8.7175
quadrupole: 4.7352 3.1864 -7.9216 1.6502 1.1579 8.7175
hfenergy: -2122.3704728 hartree
pointgroup: C01 [X(C24H15Cl2N1O3)]
dipole: 0.4061461 -1.7300211 -1.5684959 debye
polarizability: 412.3253084|5.5376903|232.3047267|11.40054|36.9757402|278.7437396 unknown
InChI: InChI=1S/C24H15Cl2NO3/c25-17-11-12-18-19(26)14-21(27-20(18)13-17)24(29)30-23(16-9-5-2-6-10-16)22(28)15-7-3-1-4-8-15/h1-14,23H
charge 0 multiplicity 1
45 atoms
Cl 2.879206 -1.563705 -2.805301
Cl 7.636573 2.187971 1.123027
O  -0.944536 0.832981 -0.104341
O  -3.436117 0.89306 2.489106
O  -0.085795 1.997841 1.730321
N  2.519295 1.490144 0.693778
C  -2.317258 1.142232 0.368033
C  -3.288962 0.913852 -0.792014
C  -2.703964 0.320017 1.633875
C  -2.252738 -1.094489 1.80027
C  3.958256 0.19582 -0.886297
C  -2.833598 0.648603 -2.106318
C  -4.682295 1.011789 -0.544303
C  3.763841 1.141353 0.204642
C  1.437405 0.924051 0.123532
C  0.103299 1.327236 0.699208
C  2.764036 -0.365804 -1.439695
C  1.507987 -0.01888 -0.958273
C  -3.761785 0.475424 -3.158252
C  -5.605196 0.838244 -1.597878
C  -2.298644 -1.652581 3.108203
C  -1.82822 -1.903329 0.710591
C  5.286109 -0.104158 -1.32111
C  4.907123 1.750755 0.816534
C  -5.14959 0.566921 -2.909136
C  6.386929 0.499699 -0.711195
C  6.17735 1.424244 0.355779
C  -1.911638 -2.988583 3.325803
C  -1.457607 -3.246624 0.930114
C  -1.490569 -3.789657 2.236112
H  -2.341592 2.198695 0.697632
H  -1.759661 0.594064 -2.305203
H  -5.041853 1.223636 0.468895
H  0.592708 -0.444447 -1.369669
H  -3.398674 0.274676 -4.172471
H  -6.678786 0.915942 -1.394294
H  -2.637239 -1.017716 3.933607
H  -1.813228 -1.493309 -0.302886
H  5.434248 -0.814118 -2.140002
H  4.736642 2.456323 1.633063
H  -5.867131 0.432569 -3.7260
H  7.404907 0.273329 -1.040454
H  -1.937999 -3.408521 4.336971
H  -1.145326 -3.870819 0.085936
H  -1.193314 -4.830928 2.404059
