program: Gaussian 09
title: 000280062
version: EM64L-G09RevD.01
frameworkgroup: C1[X(C16H12N2O6)]
method: RPBEPBE
basis: SDD
operation: Freq
keyword: #p
keyword: freq=noraman
keyword: PBEPBE/SDD
title: #p freq=noraman PBEPBE/SDD
converged: YES YES NO NO
title: Mulliken charges:
elementType: O O O O O O N N C C C C C C C C C C C C C C C C H H H H H H H H H H H H
charge: -0.200390 -0.200342 -0.424280 -0.424297 -0.253100 -0.253113 -0.058372 -0.058498 0.368461 0.368249 0.055748 0.055934 -0.383021 -0.343464 -0.343477 -0.382847 -0.087901 -0.087929 0.293632 0.293605 -0.752763 -0.752741 0.114880 0.114905 0.261043 0.250095 0.250040 0.261090 0.263133 0.246209 0.262876 0.263137 0.246200 0.262879 0.387209 0.387210
chargesum: 0.00000
title: Mulliken charges with hydrogens summed into heavy atoms:
elementType: O O O O O O N N C C C C C C C C C C C C C C C C
charge: -0.200390 -0.200342 -0.037070 -0.037087 -0.253100 -0.253113 -0.058372 -0.058498 0.368461 0.368249 0.055748 0.055934 -0.121979 -0.093369 -0.093437 -0.121757 -0.087901 -0.087929 0.293632 0.293605 0.019455 0.019475 0.114880 0.114905
polarizability: 3.61356371e+02 1.23209769e+01 1.78907791e+02 -8.90678257e-03 3.40116834e-03 1.31659976e+02
1716.lowfreq: -7.5001 -1.7441 -0.0009 -0.0008 0.0003 4.4763 15.5430 20.4492 24.2438
frequency: 14.7048 20.0443 23.9996 30.6587 32.6392 44.8129 53.0498 76.1345 96.7636 97.8272 148.1443 163.4413 186.6136 195.8403 202.2229 224.8058 245.9190 276.0001 281.2543 324.2859 344.1234 390.0082 391.5184 402.3223 406.9806 431.2822 455.2210 506.1686 541.8968 573.0563 582.0887 583.3117 608.4171 609.0749 629.7701 640.3371 651.3886 676.7888 679.3236 693.4137 716.0175 741.4032 743.9971 764.1808 772.0918 808.4216 811.1328 843.3535 857.0697 937.9261 938.5724 963.2286 963.3035 969.4588 978.2430 1009.5068 1010.8562 1020.4438 1036.4395 1036.4520 1117.6319 1125.1052 1134.8290 1172.4994 1178.4149 1209.4972 1243.9681 1244.5449 1306.0735 1312.6055 1334.9404 1351.2016 1382.6422 1388.5393 1403.4586 1405.7005 1408.6858 1424.0819 1433.7290 1442.4544 1442.4707 1457.2382 1457.5989 1527.4993 1555.0123 1568.3669 1578.4811 1624.3292 1626.3630 1628.5139 3003.3853 3003.3926 3085.4671 3085.4716 3121.5325 3121.5560 3156.8647 3156.8755 3184.1798 3187.9911 3515.2253 3515.2668
redmass: 1.7315 1.1872 2.4736 5.2047 4.6696 4.8305 5.1980 4.9432 5.0654 5.1397 7.8204 6.8690 5.1286 5.4865 8.1010 5.2029 4.6289 4.0062 4.0294 5.4328 8.5618 6.5545 7.6659 7.5126 2.8688 5.8689 6.4216 4.3218 6.2185 3.7307 1.4670 1.5337 3.9490 3.7421 4.8587 4.9527 4.6800 4.5832 5.0655 5.6046 6.2178 4.7499 7.3401 6.3899 6.8458 11.1978 7.2454 1.2490 1.9244 3.9078 3.9482 3.6201 3.5936 1.4113 1.3994 2.9106 3.1247 3.0374 1.5151 1.5155 4.8694 1.7067 2.1184 2.2575 2.2828 1.1178 4.7509 4.3186 1.7969 3.8888 2.3622 4.5080 4.3953 5.4843 1.5244 1.3189 2.4716 3.2253 6.3235 1.0447 1.0465 1.1641 1.1949 3.5749 8.3795 10.3112 8.7558 6.3736 7.9325 7.8824 1.0365 1.0365 1.0963 1.0963 1.1013 1.1013 1.0897 1.0897 1.0949 1.0964 1.0640 1.0640
irintensity: 0.4154 0.0233 0.0617 0.0016 0.3251 0.7571 0.6422 2.6242 0.1645 5.0213 0.1457 0.9169 3.5328 6.3356 0.0173 2.8603 4.0999 0.2585 3.6216 0.0034 5.3333 3.1661 0.2909 3.8968 0.0182 2.9774 3.2857 3.1975 23.0736 0.6352 65.8188 103.3211 38.0996 22.7756 40.3006 7.3347 36.4557 10.7870 35.9852 2.7629 11.8283 16.8358 0.1967 27.1233 8.5233 76.2508 0.6048 6.2437 43.9982 19.1271 13.5644 30.1341 27.4675 4.3231 0.7370 153.6558 119.3637 51.3510 6.7834 7.5425 25.6939 16.7420 64.5656 2.8666 29.1170 0.0936 6.6011 13.3471 0.0115 108.3715 5.0128 90.9444 20.4829 8.4655 1.5576 14.2123 59.0116 37.1028 6.9069 14.6415 24.0985 35.8743 0.8566 1.1185 26.9971 273.9514 39.6209 4.9964 648.9512 106.1078 3.1652 1.3661 2.3998 2.4796 11.2326 6.9409 2.3070 2.6642 9.5329 0.0562 43.4014 45.7745
temp: 298.150 k
press: 1.00000 atm
elementType: 8 8 8 8 8 8 7 7 6 6 6 6 6 6 6 6 6 6 6 6 6 6 6 6 1 1 1 1 1 1 1 1 1 1 1 1
symmnumber: 1
zpe: 664414.5 jmol-1
zpe.correction: 0.253062 hartree
zpe.thermalcorrener: 0.275197 hartree
zpe.thermalcorrenthalpy: 0.276141 hartree
zpe.thermalcorrgfe: 0.196793 hartree
zpe.sumelectzpe: -1176.002629 hartree
zpe.sumelectthermal: -1175.980494 hartree
zpe.sumelectthermalent: -1175.979550 hartree
zpe.sumelectthermalfe: -1176.058898 hartree
dipole: -0.0011 0.0007 2.8688
dipole: 2.8688
quadrupole: -121.4391 -134.9407 -141.6534
quadrupole: -2.1841 -0.0016 0.0089
quadrupole: 11.2386 -2.2629 -8.9757 -2.1841 -0.0016 0.0089
hfenergy: -1176.2556909 hartree
pointgroup: C01 [X(C16H12N2O6)]
dipole: 0.0006525 -1.1286681 -0.0002008 debye
polarizability: 362.0715507|0.0429251|131.6599848|4.5617945|0.0090485|178.1926018 unknown
InChI: InChI=1S/C16H12N2O6/c1-7-11(15(19)20)13(17-23-7)9-3-5-10(6-4-9)14-12(16(21)22)8(2)24-18-14/h3-6,19,21H,1-2H3
charge 0 multiplicity 1
36 atoms
O  -4.772264 1.071157 -1.400381
O  4.771129 1.072156 1.401487
O  -2.875011 -1.673293 1.846848
O  2.877091 -1.671844 -1.848222
O  -5.192506 -1.652539 1.852703
O  5.194512 -1.648379 -1.853408
N  -3.299859 1.188983 -1.407424
N  3.298775 1.18916 1.408206
C  -1.416683 0.333966 -0.163965
C  1.416233 0.33417 0.163925
C  -2.881345 0.398171 -0.383723
C  2.880839 0.398754 0.383874
C  -0.553891 0.34422 -1.293594
C  0.843121 0.341196 -1.133489
C  -0.84358 0.342018 1.133491
C  0.553374 0.345262 1.293601
C  -4.010511 -0.228168 0.295706
C  4.010603 -0.226166 -0.295914
C  -5.154568 0.227951 -0.373004
C  5.154231 0.230131 0.373459
C  -6.615491 -0.018101 -0.209488
C  6.615372 -0.014665 0.210036
C  -4.111124 -1.214306 1.377513
C  4.112515 -1.211442 -1.378408
H  -0.990287 0.357918 -2.296888
H  1.487816 0.342526 -2.014973
H  -1.488355 0.34396 2.014938
H  0.989832 0.359744 2.296852
H  -6.950284 0.290786 0.795798
H  -7.181157 0.535053 -0.976012
H  -6.837653 -1.096609 -0.286424
H  6.950149 0.295403 -0.794893
H  7.180426 0.538218 0.977204
H  6.838347 -1.093074 0.286006
H  -3.041646 -2.360754 2.547784
H  3.044847 -2.358864 -2.549325
