program: Gaussian 09
title: 000280040
version: EM64L-G09RevD.01
frameworkgroup: C1[X(C16H24N2O2)]
method: RPBEPBE
basis: SDD
operation: Freq
keyword: #p
keyword: freq=noraman
keyword: PBEPBE/SDD
title: #p freq=noraman PBEPBE/SDD
converged: YES YES NO NO
title: Mulliken charges:
elementType: O O N N C C C C C C C C C C C C C C C C H H H H H H H H H H H H H H H H H H H H H H H H
charge: -0.291199 -0.434693 -0.123343 -0.059423 -0.156141 -0.205336 0.329033 -0.356095 -0.372302 0.253794 -0.380655 -0.393405 0.102990 -0.756840 -0.737959 -0.376135 -0.386344 -0.614445 -0.266495 -0.216924 0.241536 0.239987 0.195389 0.191527 0.213510 0.243455 0.180275 0.202473 0.206486 0.179699 0.236529 0.216039 0.244762 0.206332 0.230901 0.251996 0.270932 0.353893 0.251483 0.185217 0.223142 0.220657 0.227055 0.228643
chargesum: 0.00000
title: Mulliken charges with hydrogens summed into heavy atoms:
elementType: O O N N C C C C C C C C C C C C C C C C
charge: -0.291199 -0.080800 -0.123343 -0.059423 0.085395 0.034651 0.329033 0.030821 0.084663 0.253794 0.002093 -0.007220 0.102990 -0.059511 -0.048729 -0.105202 -0.134861 0.014570 -0.039440 0.011719
polarizability: 2.19316793e+02 -1.22692873e+00 2.08059998e+02 9.31928235e+00 -4.77883457e+00 1.39512228e+02
1716.lowfreq: -6.2928 0.0004 0.0006 0.0011 5.2097 10.5560 39.7017 47.6588 70.8352
frequency: 39.4717 47.5984 70.6721 87.8921 115.3443 142.4111 163.8926 181.5902 186.3958 206.7230 226.8939 234.5535 239.0364 250.6936 259.6053 278.4384 299.7797 318.1701 330.8988 342.2177 358.0179 380.2955 399.2000 433.4933 449.4930 462.7005 483.7561 494.4607 527.9783 543.1680 550.9707 609.6927 644.7524 699.7073 716.8451 739.9443 753.1646 768.0049 797.1911 809.3100 828.2212 854.2087 873.1649 889.7091 906.9185 930.9489 939.7924 955.3557 967.2650 987.6114 992.3347 1008.8664 1018.7396 1027.2930 1047.8970 1052.6607 1070.7326 1078.7186 1088.6874 1120.1622 1126.0316 1144.9615 1147.4181 1158.6811 1164.0791 1174.5688 1192.0096 1196.0597 1205.3776 1213.0939 1229.0987 1240.6696 1266.8124 1268.5820 1280.5812 1287.0621 1314.1296 1319.3828 1332.2737 1345.4634 1368.2924 1371.7249 1372.1442 1375.4142 1380.9484 1384.3512 1396.1212 1427.5717 1437.5729 1453.3140 1453.7748 1458.8523 1460.6051 1463.9140 1466.4121 1470.2134 1475.6214 1476.0578 1480.5088 1490.1845 1581.3006 1614.8012 2836.8299 2840.2722 2858.9149 2885.0548 2932.5912 2959.9086 2986.6295 2996.2045 3013.7335 3014.3696 3021.1187 3026.9143 3052.9978 3056.1716 3072.9611 3081.4572 3091.9449 3092.5267 3113.1685 3127.3192 3138.2454 3153.9521 3167.7742 3528.2622
redmass: 4.1895 3.8580 3.0542 3.6677 3.9741 3.4119 2.7397 1.1292 2.7914 2.6378 1.1688 3.0687 1.5720 2.5132 1.8668 3.7291 2.1072 2.8138 2.5118 1.9706 2.5671 2.5581 2.0301 3.5320 3.3668 3.7907 3.2146 3.7961 3.7891 3.4483 5.0525 4.6080 2.7170 3.7879 4.6604 4.3964 3.0731 1.5004 3.7343 3.3787 4.7263 1.5547 1.4581 2.5780 2.9595 2.0403 1.4725 1.7527 1.5753 1.5286 1.3613 2.3337 2.4178 2.1532 2.7293 1.6192 1.7015 1.7659 2.1859 1.6116 1.8974 3.2647 2.7045 1.8860 1.2588 1.9346 1.2610 1.1451 2.7468 1.7621 2.5171 2.3459 1.9185 1.7617 1.6906 1.4930 1.4369 1.5828 1.2866 1.3187 1.3795 1.2726 1.3601 1.9635 1.7975 1.7050 1.2065 1.1721 2.4241 1.0510 1.0791 1.0666 1.0836 1.0571 2.5942 1.0982 1.0903 1.0692 1.0538 1.0542 7.1294 7.0535 1.0701 1.0640 1.0625 1.0677 1.0808 1.0652 1.0363 1.0363 1.0919 1.0724 1.0872 1.0895 1.0869 1.0952 1.1009 1.0986 1.0998 1.0988 1.0999 1.0852 1.0900 1.0945 1.0996 1.0652
irintensity: 1.5528 0.1524 0.1632 2.4461 1.6996 2.9539 5.1189 0.9656 0.0126 0.8347 0.0473 0.1464 9.0248 14.8088 15.9809 3.9391 4.7775 25.6057 8.2380 17.5672 0.7685 54.7590 0.2163 4.6237 2.4619 1.0884 1.4143 6.0640 1.3171 3.9202 6.4588 0.9729 2.6227 4.2350 0.2212 5.6224 9.1257 91.0420 4.2750 8.4468 35.0950 1.3366 6.3721 20.9669 29.4589 3.7429 4.6033 6.8308 17.7079 5.9976 8.9065 47.6522 3.4604 10.2173 48.4650 5.1916 10.5081 0.2280 29.6240 23.7055 97.7769 21.1950 40.5010 14.1235 18.5548 25.3469 19.3153 4.2030 32.5485 12.0824 17.9623 31.2815 13.0809 36.7999 24.7593 12.6893 10.5822 15.3160 10.1555 14.1322 7.2586 11.4297 16.2134 9.3916 41.1181 2.0475 26.4073 1.5702 37.5113 7.0073 0.1392 30.1975 4.4869 3.1793 48.8750 31.2667 0.3403 4.2255 8.1881 14.9377 23.8345 13.4517 62.5648 48.6608 201.0754 97.7435 25.7350 32.4818 13.7895 25.4995 41.5621 48.4993 70.6827 46.3733 14.9998 36.7102 35.4384 12.4173 23.7997 33.9823 13.7300 0.8436 6.9444 21.3826 22.0939 7.3000
temp: 298.150 k
press: 1.00000 atm
elementType: 8 8 7 7 6 6 6 6 6 6 6 6 6 6 6 6 6 6 6 6 1 1 1 1 1 1 1 1 1 1 1 1 1 1 1 1 1 1 1 1 1 1 1 1
symmnumber: 1
zpe: 985717.4 jmol-1
zpe.correction: 0.375440 hartree
zpe.thermalcorrener: 0.394789 hartree
zpe.thermalcorrenthalpy: 0.395733 hartree
zpe.thermalcorrgfe: 0.329296 hartree
zpe.sumelectzpe: -882.477594 hartree
zpe.sumelectthermal: -882.458245 hartree
zpe.sumelectthermalent: -882.457301 hartree
zpe.sumelectthermalfe: -882.523738 hartree
dipole: 0.0344 -0.0099 1.9696
dipole: 1.9699
quadrupole: -116.4756 -115.3083 -122.2933
quadrupole: 3.6702 1.7510 -7.5820
quadrupole: 1.5501 2.7174 -4.2676 3.6702 1.7510 -7.5820
hfenergy: -882.8530341 hartree
pointgroup: C01 [X(C16H24N2O2)]
dipole: 0.0040937 -0.010457 0.7749404 debye
polarizability: 218.9106459|0.8566974|207.8408929|-11.7975422|4.2901365|140.1374798 unknown
InChI: InChI=1S/C16H24N2O2/c1-16(2)15(19)14(18-10-8-17(3)9-11-18)12-6-4-5-7-13(12)20-16/h4-7,14-15,19H,8-11H2,1-3H3
charge 0 multiplicity 1
44 atoms
O  2.741869 1.001503 -0.571139
O  0.207586 1.72514 -1.668625
N  -1.3858 0.05922 0.348766
N  -4.189982 -0.273673 -0.23124
C  0.013387 0.500149 0.528655
C  0.443461 1.807235 -0.220327
C  1.944896 2.127032 0.053658
C  -2.395608 0.934045 0.982526
C  -1.832314 -0.369772 -1.001344
C  1.022716 -0.616434 0.237604
C  -3.734857 0.182899 1.102095
C  -3.163042 -1.131488 -0.871557
C  2.321185 -0.314389 -0.258736
C  2.293739 2.208714 1.55325
C  2.411282 3.379108 -0.697775
C  0.708576 -1.973121 0.49536
C  3.266209 -1.337006 -0.506367
C  -5.515399 -0.917367 -0.184052
C  1.642953 -3.002315 0.257333
C  2.925617 -2.68015 -0.251225
H  0.087889 0.744832 1.611285
H  -0.183939 2.653009 0.110108
H  -2.570518 1.869728 0.397631
H  -2.044426 1.217263 1.994055
H  -1.066231 -1.033624 -1.439153
H  -1.969422 0.495794 -1.682708
H  -3.598774 -0.678421 1.807087
H  -4.502192 0.858099 1.52688
H  -3.522628 -1.417072 -1.878324
H  -2.990612 -2.070995 -0.283626
H  3.334155 2.556333 1.674903
H  1.627896 2.926243 2.068306
H  2.205945 1.229728 2.054534
H  1.999865 4.285079 -0.217228
H  3.512927 3.439282 -0.674822
H  2.072277 3.356363 -1.745787
H  -0.294529 -2.193652 0.877562
H  0.874007 1.095763 -2.051093
H  4.252349 -1.057419 -0.890398
H  -5.534145 -1.852747 0.432729
H  -5.8378 -1.178528 -1.20822
H  -6.256574 -0.214927 0.238726
H  1.37722 -4.044578 0.463816
H  3.659989 -3.47068 -0.441827
