program: Gaussian 09
title: 000280033
version: EM64L-G09RevD.01
frameworkgroup: C1[X(C14H16N4O)]
method: RPBEPBE
basis: SDD
operation: Freq
keyword: #p
keyword: freq=noraman
keyword: PBEPBE/SDD
title: #p freq=noraman PBEPBE/SDD
converged: YES YES NO NO
title: Mulliken charges:
elementType: O N N N N C C C C C C C C C C C C C C H H H H H H H H H H H H H H H H
charge: -0.227709 -0.155700 -0.438708 -0.034699 -0.013014 -0.355201 0.111159 -0.346697 -0.124826 0.150312 0.025463 0.282278 -0.344474 -0.279455 -0.332607 -0.354109 0.179008 -0.696742 -0.780068 0.202304 0.252262 0.196377 0.243767 0.206939 0.191005 0.242396 0.260245 0.237605 0.307283 0.210473 0.217451 0.219001 0.281095 0.234031 0.233555
chargesum: 0.00000
title: Mulliken charges with hydrogens summed into heavy atoms:
elementType: O N N N N C C C C C C C C C C C C C C
charge: -0.227709 -0.155700 -0.131426 -0.034699 -0.013014 0.099365 0.111159 0.093448 -0.124826 0.150312 0.025463 0.282278 0.053470 -0.037060 -0.072361 -0.116504 0.179008 -0.049817 -0.031386
polarizability: 2.68984439e+02 -1.66327673e+01 2.05435720e+02 1.76747665e+01 1.03307182e+01 1.02783463e+02
1716.lowfreq: -8.0536 -6.1860 -0.0009 -0.0006 -0.0002 3.2241 22.6224 39.8981 55.1472
frequency: 21.8896 39.8829 55.0251 70.7167 88.6666 106.9875 118.7093 144.3372 158.8386 184.9829 223.4160 232.6333 283.2119 292.3345 300.8848 336.4163 344.2198 380.6140 418.8684 458.4374 488.6501 509.4334 545.4056 552.2010 575.6659 609.6828 611.4421 646.6612 675.3890 718.4652 732.7485 738.5647 747.2466 781.8340 813.2791 819.0749 832.6082 856.0260 896.5669 905.4910 928.4204 955.1578 960.4227 973.0729 1016.7539 1031.0835 1047.4846 1069.6805 1076.1911 1096.7704 1114.9762 1148.2450 1174.8160 1193.0226 1214.7147 1222.0860 1255.6632 1268.8409 1275.0574 1294.1063 1304.9802 1330.1243 1342.4164 1353.4382 1366.0662 1380.6264 1391.7602 1395.0360 1413.1347 1423.0131 1440.5671 1449.8059 1467.3160 1467.4998 1469.9922 1475.3418 1478.7100 1486.8406 1528.4735 1558.1346 1593.2949 1606.9221 1620.1824 2965.1876 2975.4710 2981.4552 2983.1680 3006.5594 3014.0294 3050.2081 3058.0395 3072.2404 3074.7486 3083.7697 3125.5382 3131.6710 3143.0771 3176.9523 3590.5268
redmass: 3.2629 4.9633 1.7743 4.5631 1.0651 2.7088 3.9968 4.5740 3.6882 4.2912 3.0341 1.2105 3.7872 4.8998 4.4067 3.4018 4.2344 6.5606 3.3538 4.7210 5.0336 4.5914 5.5928 4.6132 6.6798 4.0039 1.4353 2.9291 4.9787 4.8133 1.1882 4.7005 6.9805 1.3579 3.8250 3.9908 2.1181 6.4727 1.5099 1.6394 1.2681 2.9311 1.3508 2.6374 4.0997 3.3090 1.4947 3.8106 2.5948 1.9504 2.3349 1.5938 4.3665 2.2935 1.4534 1.9163 4.2355 1.3174 1.4567 1.0812 4.0530 3.5915 1.4862 1.7641 1.4678 1.5810 1.2136 1.3826 2.5279 4.1671 3.8733 1.2279 1.1869 1.0709 1.0451 1.0688 1.0426 1.0787 5.0071 6.9134 7.5060 9.3191 9.2493 1.0595 1.0364 1.0631 1.0393 1.0635 1.0950 1.0990 1.0980 1.1006 1.0997 1.1044 1.0964 1.0921 1.0900 1.0959 1.0814
irintensity: 0.7110 3.8721 0.3383 2.3453 0.3731 0.6358 6.4820 2.6600 4.1489 0.0379 1.0661 0.0894 1.3830 1.9742 0.4827 2.7639 0.4863 4.3632 0.9179 8.7058 5.1499 1.0830 2.9010 19.1093 0.2486 13.8308 69.6576 23.4118 4.7400 1.6666 10.0295 1.6740 6.4600 1.4520 8.8649 5.3030 46.6089 13.8286 16.3802 5.7577 3.8458 1.6144 0.0894 5.1534 4.0183 5.9785 4.3578 4.2031 0.1282 33.4086 18.4140 0.6418 72.6448 4.9193 12.0567 7.9790 3.3850 5.2486 2.7275 3.0313 55.6202 26.9090 17.8132 63.3107 12.5385 18.9465 10.1927 13.8887 69.1514 10.4555 2.2668 7.3031 3.9218 0.6648 18.4562 6.7356 12.2188 15.2828 161.8130 73.7830 23.6838 127.2177 215.1742 33.0963 33.9741 26.3892 36.4777 43.3566 13.7731 7.2372 17.5265 48.0409 54.1047 29.9501 3.3331 15.8856 8.2253 8.0787 50.1994
temp: 298.150 k
press: 1.00000 atm
elementType: 8 7 7 7 7 6 6 6 6 6 6 6 6 6 6 6 6 6 6 1 1 1 1 1 1 1 1 1 1 1 1 1 1 1 1
symmnumber: 1
zpe: 738158.1 jmol-1
zpe.correction: 0.281150 hartree
zpe.thermalcorrener: 0.298448 hartree
zpe.thermalcorrenthalpy: 0.299392 hartree
zpe.thermalcorrgfe: 0.234578 hartree
zpe.sumelectzpe: -835.988088 hartree
zpe.sumelectthermal: -835.970790 hartree
zpe.sumelectthermalent: -835.969845 hartree
zpe.sumelectthermalfe: -836.034659 hartree
dipole: 2.9078 0.9013 1.0449
dipole: 3.2186
quadrupole: -64.9582 -117.9558 -113.7273
quadrupole: -5.9265 6.5268 -2.4674
quadrupole: 33.9223 -19.0754 -14.8469 -5.9265 6.5268 -2.4674
hfenergy: -836.2692374 hartree
pointgroup: C01 [X(C14H16N4O1)]
dipole: -1.1434327 -0.3711819 0.3978984 debye
polarizability: 269.2450089|-15.8173453|205.7667288|-17.5889062|-7.6591536|102.1918854 unknown
InChI: InChI=1S/C14H16N4O/c1-3-4-7-18-8-15-10-5-6-11-13(12(10)14(18)19)17-9(2)16-11/h5-6,8,16H,3-4,7H2,1-2H3
charge 0 multiplicity 1
35 atoms
O  0.929978 1.47366 -0.705379
N  1.860085 -0.672278 -0.593629
N  -3.962551 0.536975 0.356627
N  0.590492 -2.651859 -0.075731
N  -2.05203 1.662354 -0.170392
C  3.19384 -0.088826 -0.889107
C  -0.531895 -0.424266 -0.170621
C  3.888988 0.467267 0.373216
C  -1.762468 0.286348 -0.033384
C  0.742921 0.240074 -0.502955
C  -0.563554 -1.849125 0.036473
C  -2.958768 -0.436509 0.299531
C  5.253673 1.11035 0.039749
C  1.719617 -2.037656 -0.377033
C  -1.780857 -2.525682 0.366854
C  -2.990507 -1.834611 0.502867
C  -3.371244 1.77822 0.068657
C  5.960921 1.673653 1.291034
C  -4.146803 3.058688 0.03945
H  3.811672 -0.874794 -1.362654
H  3.039254 0.727717 -1.615545
H  4.028543 -0.34875 1.110802
H  3.226321 1.221383 0.836717
H  5.100508 1.925463 -0.6959
H  5.90964 0.361844 -0.45103
H  2.635829 -2.631226 -0.473834
H  -1.72154 -3.608438 0.507231
H  -3.915123 -2.363778 0.755747
H  -4.945694 0.377121 0.569812
H  6.15665 0.875713 2.031979
H  6.929577 2.13833 1.031018
H  5.337466 2.443262 1.78293
H  -3.454227 3.877607 -0.204953
H  -4.946787 3.038427 -0.724252
H  -4.616523 3.278244 1.016604
