program: Gaussian 09
title: 000280037
version: EM64L-G09RevD.01
frameworkgroup: C1[X(C20H27NO3S)]
method: RPBEPBE
basis: SDD
operation: Freq
keyword: #p
keyword: freq=noraman
keyword: PBEPBE/SDD
title: #p freq=noraman PBEPBE/SDD
converged: YES YES NO NO
title: Mulliken charges:
elementType: S O O O N C C C C C C C C C C C C C C C C C C C C H H H H H H H H H H H H H H H H H H H H H H H H H H H
charge: 0.129307 -0.432341 -0.242132 -0.238951 -0.332949 -0.391991 -0.081987 -0.363075 -0.590520 0.556870 -0.692719 -0.548402 -0.450672 0.214544 -0.336546 0.191660 -0.149088 -0.397279 0.461098 -0.195374 -0.438086 -0.251081 -0.804437 -0.537739 -0.538999 0.227892 0.234822 0.214459 0.217285 0.236185 0.225993 0.195479 0.245118 0.286967 0.276831 0.244783 0.219719 0.339043 0.240128 0.245452 0.311862 0.231508 0.213070 0.233607 0.230240 0.223215 0.218206 0.218133 0.247238 0.246426 0.218864 0.218367
chargesum: 0.00000
title: Mulliken charges with hydrogens summed into heavy atoms:
elementType: S O O O N C C C C C C C C C C C C C C C C C C C C
charge: 0.129307 -0.093298 -0.242132 -0.238951 -0.087832 0.070723 0.132471 0.090395 -0.169048 0.556870 -0.128921 -0.303619 -0.230954 0.214544 -0.096418 0.191660 -0.149088 -0.151828 0.461098 0.116488 -0.206579 -0.038010 -0.117374 0.145838 0.144657
polarizability: 3.06474779e+02 -9.47752387e+00 3.14747377e+02 1.57391383e+00 -5.85111306e+00 1.58171273e+02
1716.lowfreq: -66.6532 -11.1272 -7.4216 -5.1080 0.0015 0.0018 0.0019 2.9201 12.0327
frequency: -66.6399 -7.5171 11.7629 19.5285 31.1950 34.0402 44.9812 77.6656 83.2224 93.8892 107.4815 132.4081 151.5762 155.9710 164.2345 177.2145 185.8825 190.1941 202.6703 218.5029 234.5128 240.4208 250.0568 259.3762 276.1825 325.2884 345.4113 360.2388 375.4459 385.5466 404.5925 428.1334 432.2735 438.8511 457.9413 463.8357 484.3050 516.4113 530.0741 543.2015 559.4786 579.8020 629.0449 662.5522 666.1841 696.4132 710.4343 721.7301 732.4067 744.4735 792.2935 794.2925 806.0217 824.4133 832.6814 856.3469 869.9719 885.4515 910.9635 916.2681 928.4925 965.7053 980.9458 984.1144 991.3313 997.0853 1002.5573 1018.4970 1030.9028 1036.5572 1046.8075 1071.5461 1077.6212 1092.5587 1111.2323 1111.7593 1114.3455 1129.6342 1132.4392 1141.7628 1149.8792 1156.7896 1176.4003 1190.3801 1198.4268 1217.3626 1220.7046 1224.3689 1237.5339 1261.7854 1273.4340 1278.5273 1283.5162 1290.9237 1312.4149 1321.1102 1348.0256 1365.4722 1372.9211 1384.1702 1394.2470 1395.1792 1409.3192 1412.7521 1434.9052 1435.1373 1443.6876 1448.9938 1466.2783 1466.5331 1467.4978 1469.6745 1469.7344 1471.3262 1472.0021 1481.3641 1486.2834 1495.8919 1507.5516 1583.2913 1591.3093 1602.8338 1612.4206 2885.9279 2918.7959 2953.6807 2954.8664 2967.0022 2977.9497 2992.3912 3013.3149 3013.9177 3040.0701 3040.8958 3043.2249 3043.9891 3057.2040 3076.6927 3086.2345 3119.0212 3119.3760 3120.4921 3123.2645 3123.8659 3124.9615 3141.6030 3143.7979 3162.3689 3405.4613 3464.2817
redmass: 1.0187 4.1805 4.8829 6.2467 4.5470 4.2585 4.5686 5.0572 3.4456 3.2528 3.0918 4.1548 3.8057 4.0812 2.9100 3.2646 3.5751 2.9914 2.4833 2.7835 3.2134 1.4766 3.5574 1.7461 2.2774 2.9803 2.8683 3.7419 3.6824 3.1763 4.9934 2.5876 4.0880 2.6736 1.6346 2.2588 5.4822 4.9330 4.0029 4.2334 4.4817 3.9621 4.0913 4.0227 5.9882 2.6434 1.9692 2.5893 4.1157 2.9731 1.2996 1.2238 1.4137 2.5408 4.7987 1.6410 2.0706 1.3617 2.0819 2.1534 1.3291 2.4116 4.8717 7.6172 1.4778 3.8591 1.3689 2.2666 2.7784 2.3398 1.5560 1.7817 2.2174 1.7508 1.2617 1.2612 1.5791 2.0654 3.4339 1.5927 1.1329 1.4021 1.5608 1.5573 1.1496 1.4478 1.7335 2.6289 1.3281 2.9318 1.3102 1.2492 1.2267 1.6194 1.3230 1.3656 1.3908 1.2020 6.9534 1.4351 4.3354 1.2366 2.9021 1.8094 1.2551 1.1813 1.3583 1.2263 1.0509 1.0506 1.6217 1.0755 1.0767 1.0912 1.0624 1.2760 1.1282 1.0814 2.7294 5.0912 7.1267 6.2090 6.7666 1.0704 1.0670 1.0332 1.0333 1.0641 1.0372 1.0844 1.0916 1.0869 1.1037 1.1037 1.0996 1.0592 1.0975 1.0949 1.0988 1.1016 1.0927 1.0915 1.0929 1.0987 1.0949 1.0902 1.0978 1.0937 1.0734 1.0651
irintensity: 0.3782 0.0240 0.1513 0.1000 0.0788 0.1483 0.0185 0.3780 14.7628 1.9730 0.3170 0.6274 3.2043 2.7701 4.1299 5.1218 4.1290 5.1124 2.2467 0.7250 1.3040 0.5119 1.4996 1.0383 2.0743 0.7312 2.7048 2.5142 0.6450 2.9330 3.6070 24.5432 3.2298 11.6260 69.0310 51.9119 1.7249 2.1950 1.5785 1.0870 14.4137 7.9646 19.7256 6.7768 14.2653 3.1450 57.0570 5.4092 12.1147 7.2201 41.1123 18.7393 54.8252 16.1848 19.2964 19.4379 16.6628 3.6938 5.4126 2.1576 7.9902 46.9437 0.5110 28.3964 4.9541 38.6428 11.6932 9.0900 15.2850 38.6923 12.6554 13.1921 5.5344 16.6415 0.0826 0.2966 3.2736 158.2556 66.7839 12.4108 4.7496 15.6772 25.2932 40.7995 3.2396 35.1093 68.3205 3.5054 27.2168 163.4168 8.4438 9.2893 6.5187 20.8945 4.4993 6.9111 3.8389 63.2719 1.7546 8.2301 11.2936 12.1222 17.9870 7.5063 16.8212 16.3439 13.8380 33.3552 1.3505 26.9174 16.4454 56.7664 24.4605 12.1198 38.4866 28.0429 17.3657 8.9412 154.2600 39.7079 41.6159 43.7837 18.2192 83.3656 77.4683 116.6667 16.7552 36.4114 39.0494 7.0361 39.0829 22.1200 29.6386 72.2895 40.4522 22.5407 20.5248 51.1689 19.4121 4.7160 8.9006 15.0842 61.0790 7.5566 3.1688 11.3251 29.8514 11.5514 1.3373 15.2610
temp: 298.150 k
press: 1.00000 atm
elementType: 16 8 8 8 7 6 6 6 6 6 6 6 6 6 6 6 6 6 6 6 6 6 6 6 6 1 1 1 1 1 1 1 1 1 1 1 1 1 1 1 1 1 1 1 1 1 1 1 1 1 1 1
symmnumber: 1
zpe: 1126814.4 jmol-1
zpe.correction: 0.429181 hartree
zpe.thermalcorrener: 0.454490 hartree
zpe.thermalcorrenthalpy: 0.455434 hartree
zpe.thermalcorrgfe: 0.371467 hartree
zpe.sumelectzpe: -1454.866416 hartree
zpe.sumelectthermal: -1454.841107 hartree
zpe.sumelectthermalent: -1454.840163 hartree
zpe.sumelectthermalfe: -1454.924130 hartree
dipole: -1.6822 1.1997 0.9955
dipole: 2.2935
quadrupole: -170.6955 -136.5704 -160.9886
quadrupole: 10.9139 0.4097 -7.6219
quadrupole: -14.6107 19.5144 -4.9037 10.9139 0.4097 -7.6219
hfenergy: -1455.295597 hartree
pointgroup: C01 [X(C20H27N1O3S1)]
dipole: -0.6511693 -0.4757601 -0.4047295 debye
polarizability: 306.331052|15.1818067|303.3690341|17.8545167|-35.3416802|169.6933439 unknown
InChI: InChI=1S/C20H27NO3S/c1-15-5-4-6-18(11-15)25-14-17(22)13-21-10-9-16-7-8-19(23-2)20(12-16)24-3/h4-8,11-12,17,21-22H,9-10,13-14H2,1-3H3
charge 0 multiplicity 1
52 atoms
S  5.018057 0.403721 0.984407
O  4.383717 3.47691 1.162064
O  -5.590379 1.971262 -0.682691
O  -6.078347 -0.591267 -0.228695
N  1.430544 1.972918 -0.641021
C  2.237635 2.439743 0.510218
C  3.681624 2.775089 0.07818
C  0.046156 1.568553 -0.297308
C  -0.704537 1.061693 -1.554263
C  -2.114984 0.58941 -1.23552
C  4.500024 1.568478 -0.424803
C  -3.180525 1.525123 -1.133994
C  -2.391201 -0.771937 -0.994226
C  -4.487944 1.115336 -0.797836
C  -3.697452 -1.201174 -0.655031
C  -4.753626 -0.271361 -0.552134
C  3.853644 -1.02724 0.884675
C  4.24724 -2.176977 1.610742
C  3.438929 -3.341456 1.622542
C  2.644841 -1.020342 0.150863
C  2.230179 -3.33477 0.880414
C  1.845821 -2.186485 0.15275
C  3.878319 -4.570531 2.401108
C  -5.359526 3.395232 -0.926572
C  -6.3782 -2.001585 0.022329
H  2.257605 1.63355 1.271048
H  1.820937 3.347235 1.005348
H  3.64891 3.523961 -0.738976
H  -0.539537 2.393916 0.175544
H  0.102963 0.753296 0.449413
H  -0.111024 0.241632 -1.999868
H  -0.734846 1.879334 -2.30408
H  1.429392 2.671408 -1.400323
H  5.458768 1.916983 -0.841997
H  3.953429 0.989997 -1.186389
H  -2.975448 2.583283 -1.329533
H  -1.585623 -1.51165 -1.073633
H  4.585118 2.800775 1.866116
H  -3.883059 -2.264582 -0.477292
H  5.194211 -2.173132 2.165085
H  2.314835 -0.132823 -0.40584
H  1.594165 -4.227675 0.873266
H  0.90858 -2.190658 -0.416857
H  4.800788 -5.007438 1.973706
H  4.094047 -4.323596 3.45706
H  3.100457 -5.353054 2.38846
H  -4.631641 3.816819 -0.20532
H  -5.003996 3.576752 -1.960195
H  -6.340662 3.871121 -0.783495
H  -7.45329 -2.026389 0.252844
H  -5.801851 -2.390755 0.884855
H  -6.173039 -2.62435 -0.870838
