program: Gaussian 09
title: 000279980
version: EM64L-G09RevD.01
frameworkgroup: C1[X(C10H13NO2)]
method: RPBEPBE
basis: SDD
operation: Freq
keyword: #p
keyword: freq=noraman
keyword: PBEPBE/SDD
title: #p freq=noraman PBEPBE/SDD
converged: YES YES NO NO
title: Mulliken charges:
elementType: O O N C C C C C C C C C C H H H H H H H H H H H H H
charge: -0.332123 -0.378442 -0.328549 -0.385220 -0.578297 -0.492310 0.503721 -0.411649 -0.413381 0.309212 -0.228111 -0.225510 -0.244480 0.224141 0.224047 0.274909 0.193797 0.205513 0.232372 0.228346 0.240264 0.221992 0.223051 0.226263 0.332307 0.378135
chargesum: 0.00000
title: Mulliken charges with hydrogens summed into heavy atoms:
elementType: O O N C C C C C C C C C C
charge: -0.332123 -0.000307 0.003758 0.062969 -0.109590 -0.054425 0.503721 -0.183303 -0.173116 0.309212 -0.006119 -0.002459 -0.018217
polarizability: 1.64378853e+02 -4.20116064e+00 1.17741983e+02 -1.63392223e+00 -1.16410109e+00 7.63510468e+01
1716.lowfreq: -0.0005 -0.0005 -0.0001 2.6054 5.9497 17.1177 23.4722 25.8519 33.9395
frequency: 23.2619 25.7417 33.8756 88.0524 105.9294 160.4695 211.1051 247.4932 271.3365 308.4211 340.7770 383.9736 403.6044 433.0989 498.6910 518.0589 580.0202 602.7203 617.7058 697.4020 706.4234 754.6782 788.2328 810.9405 854.4625 858.8935 908.2225 922.5956 975.9620 978.4448 989.9105 993.2271 1008.1347 1026.7494 1032.6398 1065.9337 1087.7994 1145.7405 1171.1322 1176.6786 1186.4545 1218.1083 1239.9408 1279.5677 1302.5978 1320.6777 1328.2978 1342.1296 1375.2082 1381.9401 1439.8510 1449.1500 1468.5454 1483.7021 1489.6218 1491.9607 1570.3046 1592.5348 1614.3583 2979.9001 2984.7878 2991.4607 3036.0570 3044.5240 3070.4677 3111.0555 3116.6302 3130.4508 3141.7007 3160.7380 3215.1028 3619.8210
redmass: 7.4117 3.9130 4.9477 3.6318 4.2987 3.7822 5.4018 3.2048 3.2787 4.0251 2.3478 1.5250 2.8241 2.2262 3.2568 1.1964 2.9814 3.5961 6.3525 2.8039 1.7521 2.0274 1.5452 2.4035 1.2530 2.4684 2.5635 1.7963 1.4600 3.1096 6.0106 1.3330 2.6174 2.1944 2.2392 2.7843 1.6325 1.2189 1.0570 1.2871 1.1160 2.4653 1.2945 1.2749 1.2679 1.3573 1.2460 1.5527 1.8361 7.6582 2.1595 1.1409 1.0947 2.2997 1.9529 1.1205 3.3747 5.9927 6.1697 1.0594 1.0628 1.0631 1.0997 1.0997 1.1016 1.0869 1.0865 1.0910 1.0959 1.1015 1.0630 1.0832
irintensity: 1.2620 1.4276 3.3010 1.3415 1.8163 2.1615 5.1985 21.5833 1.7419 41.7891 6.2839 55.3290 0.0134 26.0423 14.4671 175.9337 1.8019 9.8614 0.1192 6.2198 53.5001 45.5189 3.3783 3.7229 0.0593 0.6021 4.5203 7.1834 8.0829 92.5676 0.5296 0.4621 10.3708 4.6181 0.7288 32.9213 6.1226 3.1149 0.5270 31.9860 0.1287 0.5871 18.4699 3.4711 2.1333 33.9385 0.3024 87.2112 85.8665 1.1862 8.8970 27.8152 2.1612 24.0026 68.7104 19.6536 93.8232 1.6464 9.6872 19.3366 21.6783 37.0111 17.2864 25.4808 19.2619 10.7296 4.6321 11.9117 47.2367 25.0865 31.1744 71.7052
temp: 298.150 k
press: 1.00000 atm
elementType: 8 8 7 6 6 6 6 6 6 6 6 6 6 1 1 1 1 1 1 1 1 1 1 1 1 1
symmnumber: 1
zpe: 556180.9 jmol-1
zpe.correction: 0.211838 hartree
zpe.thermalcorrener: 0.224757 hartree
zpe.thermalcorrenthalpy: 0.225701 hartree
zpe.thermalcorrgfe: 0.169830 hartree
zpe.sumelectzpe: -593.047574 hartree
zpe.sumelectthermal: -593.034656 hartree
zpe.sumelectthermalent: -593.033711 hartree
zpe.sumelectthermalfe: -593.089582 hartree
dipole: -0.0965 -2.7080 -2.2035
dipole: 3.4926
quadrupole: -77.8644 -70.3768 -80.4265
quadrupole: 7.8618 4.0459 0.2741
quadrupole: -1.6418 5.8458 -4.2040 7.8618 4.0459 0.2741
hfenergy: -593.2594122 hartree
pointgroup: C01 [X(C10H13N1O2)]
dipole: 0.0391853 -0.893974 1.0427648 debye
dipolederiv: -0.7355377 -0.1131673 -0.0576269 0.0482521 -0.5078022 0.2964391 -0.3269795 0.0977013 -0.8231973 -0.5823551 -0.1126626 0.0051263 -0.3397632 -0.4474457 -0.1041636 0.1589212 0.0241901 -0.2089051 -0.4344614 0.1512235 -0.1866692 0.2734108 -0.0596626 -0.0996868 -0.4158374 -0.2337059 -0.4244894 0.1791446 0.0514676 -0.024239 -0.0258541 0.0882029 0.0036018 0.1203542 -0.0184791 0.0824605 -0.123686 0.0284679 -0.0077203 0.016082 0.1286417 0.0485483 -0.1220093 0.0765889 0.0533519 -0.1812957 -0.1011498 0.0441721 -0.0929626 -0.0085328 0.0764007 -0.0389509 0.0584986 0.0960832 0.3890313 -0.0899339 -0.015079 -0.1368223 -0.0132548 -0.0113139 -0.0559168 -0.0006886 -0.0636199 -0.1973547 0.004529 -0.0281917 -0.041071 0.0825727 0.0151726 -0.0125408 -0.0010477 -0.1621489 -0.1144636 0.0793122 -0.0362863 0.1586592 -0.0092705 -0.0168262 -0.0188772 -0.0186696 -0.1505646 0.9916001 0.1983723 0.4386544 0.2344357 0.4087484 -0.2192642 0.6457042 -0.1070943 0.8987754 0.0431006 0.0648192 -0.0346483 0.0896031 0.0572932 -0.0129529 -0.0335273 -0.0111422 -0.1409114 -0.015143 -0.0249573 -0.0240068 -0.049753 0.1260803 -0.0030815 -0.0224668 -0.000615 -0.1417694 0.0348131 -0.0422075 -0.0528484 -0.0402145 -0.083805 0.0092929 -0.0380138 0.0061583 -0.171247 0.0522122 0.0251783 -0.0051675 0.0324294 -0.0708573 -0.1177698 0.0000041 -0.0711254 0.0000537 -0.0448691 -0.0982447 0.0635681 -0.0616018 -0.0302843 0.1128324 0.0385754 0.0710899 -0.010173 0.1194911 0.0039027 0.0464028 -0.0238946 0.0041121 0.0730189 0.045805 0.0377214 0.0330528 0.0149244 0.0133309 -0.0067825 0.0523803 -0.1140393 -0.1254495 0.0134008 -0.070301 0.0112906 -0.0948305 0.0326712 -0.1101752 0.0039401 0.0570684 0.0455555 -0.1045517 0.0982505 -0.0919503 0.0739642 -0.0306846 0.0064938 -0.0130272 -0.042359 -0.0680762 0.0695164 -0.1072575 -0.0007722 0.0782668 0.0789227 0.0219892 0.0629582 -0.1106866 -0.0082506 0.0204218 -0.0125058 0.1372322 -0.0119521 -0.1073078 0.0393163 -0.1025072 0.0059953 0.0115994 0.0378907 0.0200498 0.13351 -0.0427277 -0.1045194 0.0298933 -0.1196138 -0.0251146 0.0198412 0.0379065 0.0186951 0.1498145 0.0592019 0.0524997 0.013369 0.072941 -0.1232098 -0.0028147 0.0178512 -0.0041888 0.1523562 -0.1245933 0.0571962 0.047195 0.0595224 0.0700373 -0.0087485 0.05106 -0.009074 0.1550601 0.2796472 -0.0893414 -0.0358155 -0.1034211 0.2449811 0.0769312 -0.0080564 0.0901376 0.2577359 0.3878724 0.0722829 -0.1309235 0.0458922 0.3725913 0.0091646 -0.0596836 0.0668134 0.2289718 unknown
polarizability: 163.8653632|6.5494432|117.4004784|1.7370523|-5.8773205|77.2060405 unknown
InChI: InChI=1S/C10H13NO2/c12-10(11-13)8-4-7-9-5-2-1-3-6-9/h1-3,5-6,11,13H,4,7-8H2
charge 0 multiplicity 1
26 atoms
O  2.737423 0.691908 -0.9621
O  4.894522 1.440128 0.359171
N  4.073814 0.363884 0.845884
C  0.623648 -0.7423 0.815887
C  -0.138967 -0.616833 -0.533495
C  2.121196 -1.120737 0.647526
C  -1.591167 -0.217168 -0.320148
C  -2.598809 -1.197285 -0.12427
C  -1.964358 1.151489 -0.2692
C  2.966952 0.021468 0.10952
C  -3.940515 -0.823881 0.117107
C  -3.304162 1.530815 -0.027704
C  -4.298034 0.543479 0.167955
H  0.538505 0.208883 1.375732
H  0.134914 -1.518568 1.43629
H  0.387499 0.121257 -1.163589
H  -0.083464 -1.59146 -1.058132
H  2.532597 -1.46436 1.617042
H  2.205235 -1.969775 -0.05912
H  -2.330607 -2.260779 -0.170918
H  -1.19939 1.921498 -0.430257
H  -4.705839 -1.595667 0.259833
H  -3.574187 2.592798 0.00243
H  -5.338131 0.835716 0.351791
H  4.428135 -0.030306 1.71475
H  4.385791 1.683196 -0.485086
