program: Gaussian 09
title: 000279973
version: EM64L-G09RevD.01
frameworkgroup: C1[X(C8H8N2)]
method: RPBEPBE
basis: SDD
operation: Freq
keyword: #p
keyword: freq=noraman
keyword: PBEPBE/SDD
title: #p freq=noraman PBEPBE/SDD
converged: YES YES YES YES
title: Mulliken charges:
elementType: N N C C C C C C C C H H H H H H H H
charge: -0.683981 -0.042435 0.382778 0.134485 0.319978 -0.471087 -0.416200 -0.186465 -0.804948 -0.300355 0.238816 0.225563 0.225711 0.242774 0.242774 0.231473 0.346234 0.314887
chargesum: 0.00000
title: Mulliken charges with hydrogens summed into heavy atoms:
elementType: N N C C C C C C C C
charge: -0.022861 -0.042435 0.382778 0.134485 0.319978 -0.232272 -0.190637 0.039246 -0.087927 -0.300355
polarizability: 1.34409887e+02 -2.11305617e+00 1.15156624e+02 -2.00417329e-03 1.93294823e-03 4.50510163e+01
1716.lowfreq: -10.5156 -7.8201 -0.0008 -0.0005 -0.0001 3.8041 67.1658 106.1566 129.4272
frequency: 67.0368 106.1525 129.4259 210.5215 223.4628 280.3220 405.3088 409.4049 426.1056 450.3798 484.8995 506.8815 561.1867 578.5852 590.9443 632.7184 744.7291 787.5918 790.1751 870.0414 949.3572 972.8372 1000.1327 1045.4717 1075.5921 1099.5831 1182.9777 1189.2160 1265.3884 1339.3224 1384.4573 1401.9825 1454.5654 1464.8207 1470.7761 1487.1778 1586.7923 1612.1677 1644.8098 2148.9825 2981.7233 3058.7798 3096.1134 3126.5256 3142.5618 3161.6813 3545.0122 3690.3302
redmass: 1.0701 4.2446 7.4627 3.2321 4.3099 3.0045 1.2154 3.4167 3.1393 6.1995 1.1403 5.3070 4.0789 4.0018 6.4091 5.0156 2.1724 1.8516 5.5762 1.3979 2.1956 1.3424 1.8063 1.5520 2.0483 1.5938 1.1858 3.6303 1.7692 2.5376 5.4573 1.2752 1.9639 1.0441 2.1985 1.8692 6.4928 4.5088 1.2731 12.6059 1.0376 1.0971 1.0991 1.0861 1.0920 1.0991 1.0461 1.1033
irintensity: 1.4069 2.8321 5.1245 3.7004 3.2621 3.9200 102.2013 1.8142 0.0575 1.1042 204.3485 0.1043 0.9245 2.1779 0.1075 0.5120 23.0197 57.9808 0.9638 0.9251 6.8330 1.2195 0.4866 9.6922 9.4045 7.3717 10.2804 0.6103 1.0668 27.4020 36.2861 9.9242 4.0368 15.1704 12.2033 83.7621 68.5870 49.1126 233.3985 74.8245 17.5503 13.6154 19.2595 4.0242 20.3734 21.7174 70.9204 30.9721
temp: 298.150 k
press: 1.00000 atm
elementType: 7 7 6 6 6 6 6 6 6 6 1 1 1 1 1 1 1 1
symmnumber: 1
zpe: 369855.5 jmol-1
zpe.correction: 0.140871 hartree
zpe.thermalcorrener: 0.150321 hartree
zpe.thermalcorrenthalpy: 0.151265 hartree
zpe.thermalcorrgfe: 0.106406 hartree
zpe.sumelectzpe: -418.449427 hartree
zpe.sumelectthermal: -418.439977 hartree
zpe.sumelectthermalent: -418.439032 hartree
zpe.sumelectthermalfe: -418.483891 hartree
dipole: -3.5515 -1.4335 0.0003
dipole: 3.8299
quadrupole: -67.2914 -42.9503 -62.7336
quadrupole: 0.5360 0.0004 0.0000
quadrupole: -9.6330 14.7082 -5.0752 0.5360 0.0004 0.0000
hfenergy: -418.5902973 hartree
pointgroup: C01 [X(C8H8N2)]
dipole: -1.3901306 0.5813225 -0.0001167 debye
dipolederiv: -0.3173543 -0.6176708 -0.000005 -0.3594822 -1.2053586 -0.0000438 -0.0000069 -0.00009 -0.6973178 -0.6177084 0.0541138 0.0000132 -0.0529106 -0.2484734 -0.0000002 -0.0000121 0.0000045 -0.2623026 0.4887848 -0.2632695 -0.0000074 0.2364369 0.3185755 0.0000257 -0.0000055 0.0000434 0.0190477 -0.4013213 0.2247679 -0.0000053 -0.2581923 -0.2904482 -0.0000138 -0.0000021 -0.0000033 -0.0155929 0.3216137 0.732894 0.000022 0.2766001 1.1890213 0.0000418 0.0000129 0.000046 0.1565127 -0.4672262 0.3428521 0.0000075 0.1919727 -0.2595469 0.0000013 0.0000031 0.0000018 -0.2426224 -0.1527403 -0.5792205 -0.0000125 -0.0185449 -0.2401262 -0.0000018 -0.0000031 -0.0000091 -0.2457146 0.1639632 0.02972 0.0000046 -0.1973371 0.4642136 0.0000098 0.0000032 0.0000097 -0.0902598 -0.0251449 0.1728707 0.0000031 0.0949587 -0.0619336 -0.0000135 0.0000199 -0.0000562 0.0508572 0.721559 -0.1018694 -0.000005 0.0626384 -0.0730689 0.0000001 0.0000072 -0.0000051 0.0155127 0.0361377 -0.0605193 -0.000005 -0.0915476 -0.0762872 -0.0000052 -0.0000059 -0.0000021 0.1704726 0.0292458 0.055755 -0.0000013 0.0986618 -0.0943119 -0.0000043 -0.0000002 -0.0000072 0.1755317 -0.1291989 0.0044919 -0.0000045 -0.0014229 0.0942226 -0.0000006 -0.0000051 0.0000012 0.1485805 0.0258211 0.0448454 0.1028049 0.0130223 0.0487639 0.0221992 0.1043232 -0.0307578 -0.026498 0.0257677 0.0448292 -0.1028234 0.0129941 0.0487811 -0.0222218 -0.1043391 0.0307446 -0.0264308 -0.0047764 -0.1676469 0.0000255 -0.0628259 -0.0603451 0.0000208 0.0000122 0.0000318 0.110264 0.1664314 0.0627781 0. 0.0261517 0.2114889 0.0000004 0.0000062 0.0000132 0.3798947 0.1361464 0.0202783 -0.0000114 0.0288268 0.2348331 0.0000058 -0.0000081 0.0000345 0.380065 unknown
polarizability: 134.4594337|1.8731302|115.1070776|0.002028|0.0019079|45.0510163 unknown
InChI: InChI=1S/C8H8N2/c1-6-3-2-4-8(10)7(6)5-9/h2-4H,10H2,1H3
charge 0 multiplicity 1
18 atoms
N  0.373995 2.462838 0.000072
N  3.051755 0.149024 0.000109
C  -0.258874 -1.248412 -0.000026
C  0.42326 0.009352 0.000007
C  -0.301556 1.252169 0.000025
C  -1.669028 -1.252704 -0.000045
C  -1.725714 1.206701 0.000002
C  -2.389338 -0.031004 -0.000033
C  0.531804 -2.542245 -0.000067
C  1.855453 0.061721 0.00003
H  -2.206032 -2.206533 -0.000071
H  -2.296211 2.142597 0.000016
H  -3.485016 -0.050272 -0.000053
H  1.188649 -2.612335 -0.88718
H  1.188925 -2.612235 0.886847
H  -0.140145 -3.416168 0.00008
H  1.391816 2.493396 0.00007
H  -0.137747 3.340209 0.000018
