program: Gaussian 09
title: 000279992
version: EM64L-G09RevD.01
frameworkgroup: C1[X(C18H20Br2N2)]
method: RPBEPBE
basis: SDD
operation: Freq
keyword: #p
keyword: freq=noraman
keyword: PBEPBE/SDD
title: #p freq=noraman PBEPBE/SDD
converged: YES YES NO NO
title: Mulliken charges:
elementType: Br Br N N C C C C C C C C C C C C C C C C C C H H H H H H H H H H H H H H H H H H H H
charge: -0.016208 -0.016305 -0.219945 -0.182874 -0.114265 -0.114963 -0.437382 -0.437183 -0.740676 -0.740604 0.435416 0.453443 -0.360700 -0.360694 -0.360490 -0.360731 -0.243803 -0.243734 -0.233936 -0.234098 -0.261833 -0.264027 0.273145 0.273149 0.249044 0.224015 0.249210 0.223823 0.316127 0.306783 0.316093 0.306916 0.246306 0.246254 0.233873 0.234060 0.227597 0.227579 0.221149 0.221110 0.231900 0.227458
chargesum: 0.00000
title: Mulliken charges with hydrogens summed into heavy atoms:
elementType: Br Br N N C C C C C C C C C C C C C C C C C C
charge: -0.016208 -0.016305 -0.219945 -0.182874 0.158880 0.158186 0.035678 0.035850 -0.117766 -0.117595 0.435416 0.453443 -0.114393 -0.114440 -0.126618 -0.126671 -0.016206 -0.016155 -0.012787 -0.012987 -0.029933 -0.036569
polarizability: 3.35260175e+02 4.09596625e-02 2.59817472e+02 -7.76800502e-02 3.27961573e+01 1.51611106e+02
1716.lowfreq: -1.8291 -0.0004 0.0000 0.0004 5.1725 7.2910 17.5072 28.6803 34.9540
frequency: 17.4841 28.6741 34.9537 47.8095 61.3498 71.6980 71.7291 103.4426 138.2510 147.4773 190.9144 193.5776 202.8776 206.4003 224.4157 228.9454 268.3868 309.7569 351.2092 398.3901 410.7147 414.4887 432.1652 454.3483 482.4770 512.9583 514.6098 558.1729 574.4839 603.2336 614.1250 615.4888 661.5731 677.0828 692.5489 696.0030 733.7286 753.0231 754.1169 798.2462 817.3423 819.7908 843.0270 854.1559 869.5346 879.7647 907.9551 922.6368 946.3704 956.0456 962.0556 976.7320 977.0425 978.3456 982.8138 996.4583 997.5927 1032.8624 1037.8397 1071.9122 1075.3201 1093.9565 1099.8374 1109.0409 1121.7390 1144.0384 1173.3700 1175.3242 1185.6930 1202.8374 1215.6727 1230.2256 1234.3417 1244.3363 1250.8247 1272.9168 1299.7313 1319.4205 1332.2250 1338.1796 1340.1218 1345.6765 1357.2412 1365.2140 1373.8550 1383.0212 1390.6295 1391.3556 1434.6447 1436.6921 1449.4462 1451.0589 1486.2698 1489.4373 1493.9111 1502.6493 1580.2572 1581.3677 1615.6691 1621.5585 2915.0285 2919.3437 3009.6238 3010.8006 3031.5097 3032.2739 3065.7975 3066.0343 3124.3304 3128.5254 3130.7315 3134.5425 3151.7967 3152.6689 3153.7876 3154.8287 3156.5772 3157.5328 3169.7270 3171.8537
redmass: 7.3714 10.9391 13.1046 8.4428 3.6565 3.8707 4.9528 5.1135 27.5035 4.1350 2.7741 3.7505 4.5748 3.9411 4.5799 4.7709 4.1420 3.1540 2.3988 3.7937 2.9680 2.9553 3.7260 3.4470 4.8329 2.8421 3.0303 6.9040 3.3209 5.7409 6.3845 6.0711 4.5930 4.5162 1.8384 1.9225 5.0209 1.8615 1.7921 1.6356 1.3555 1.2907 2.0609 3.2317 1.5109 1.4165 1.8768 2.8198 3.5038 1.3755 1.3921 1.3075 5.2557 5.4979 1.3056 2.9132 1.6904 2.1117 2.0832 1.9639 1.7867 1.6000 1.7605 2.3049 1.4270 1.2144 1.0952 1.2011 1.6456 1.1325 1.1810 1.6038 1.1602 2.1828 1.2043 1.4355 2.2204 1.3508 1.3459 1.5335 1.3606 1.5426 1.8005 1.5784 2.1652 3.7233 1.4863 3.4303 1.1318 1.1036 2.4856 2.3837 1.3739 1.0959 2.0910 1.8327 6.0411 5.8545 6.0201 5.9948 1.0699 1.0714 1.0842 1.0847 1.0910 1.0894 1.0561 1.0560 1.0844 1.0847 1.0883 1.0882 1.0913 1.0951 1.1104 1.1076 1.0946 1.0960 1.1007 1.1011
irintensity: 0.0030 0.0843 1.1437 0.1225 0.7119 0.0694 0.3777 0.0178 0.4928 1.7167 2.4726 10.0394 0.5133 10.7047 0.7505 0.5856 3.5136 5.7137 0.0683 8.5961 0.4147 0.1857 6.1351 0.5692 37.7464 12.5015 3.4179 7.2322 12.9577 7.5105 3.4201 4.6643 106.3477 8.3581 35.1029 34.3296 0.0573 40.3849 128.1777 9.3146 1.7862 1.9238 0.2191 1.1138 4.7480 3.2424 1.8577 1.3548 49.5976 0.0286 0.5113 0.0710 6.2641 9.7562 0.3290 1.2988 2.2357 21.5830 13.2505 5.0601 19.3698 6.4649 0.2410 19.6087 6.4557 4.0142 4.4547 12.1718 52.2565 4.8055 3.3076 68.3169 11.4860 12.1569 22.1707 36.1145 157.6508 24.1221 2.6697 35.5238 5.3519 9.9482 208.5589 0.3811 0.1979 0.7222 44.0153 3.8061 40.6205 1.0416 0.1920 0.7743 336.3458 7.2402 68.8320 59.9329 7.6911 14.1853 246.0944 120.9119 104.5652 40.0395 25.2200 1.3513 17.8393 2.4337 5.1062 8.1101 10.4952 10.0248 8.2997 4.6942 44.2123 30.6845 0.9164 0.0481 30.2783 31.1289 7.9134 11.6134
temp: 298.150 k
press: 1.00000 atm
elementType: 35 35 7 7 6 6 6 6 6 6 6 6 6 6 6 6 6 6 6 6 6 6 1 1 1 1 1 1 1 1 1 1 1 1 1 1 1 1 1 1 1 1
symmnumber: 1
zpe: 891983.7 jmol-1
zpe.correction: 0.339739 hartree
zpe.thermalcorrener: 0.360220 hartree
zpe.thermalcorrenthalpy: 0.361165 hartree
zpe.thermalcorrgfe: 0.286926 hartree
zpe.sumelectzpe: -832.722463 hartree
zpe.sumelectthermal: -832.701981 hartree
zpe.sumelectthermalent: -832.701037 hartree
zpe.sumelectthermalfe: -832.775276 hartree
dipole: -1.3471 -0.0066 0.0004
dipole: 1.3471
quadrupole: -146.7286 -167.0929 -145.9146
quadrupole: 0.0467 -0.0212 7.1299
quadrupole: 6.5168 -13.8475 7.3307 0.0467 -0.0212 7.1299
hfenergy: -833.0622016 hartree
pointgroup: C01 [X(C18H20Br2N2)]
dipole: 0.5299966 -0.0020935 -0.0026286 debye
polarizability: 335.255535|-0.1486498|257.1544814|-0.9186385|-36.8324652|154.2787368 unknown
InChI: InChI=1S/C18H20Br2N2/c19-11-17-13-21(15-7-3-1-4-8-15)14-18(12-20)22(17)16-9-5-2-6-10-16/h1-10,17-18H,11-14H2
charge 0 multiplicity 1
42 atoms
Br 0.130458 -4.073052 0.054475
Br 0.147457 4.076921 -0.052519
N  1.402981 -0.000634 -0.004087
N  -1.505803 0.007279 0.011881
C  0.644043 -1.180972 0.463893
C  0.644554 1.182773 -0.465412
C  -0.743873 -0.773204 0.998637
C  -0.750865 0.781398 -0.984917
C  0.551966 -2.220785 -0.681819
C  0.568825 2.22347 0.680624
C  2.821028 -0.004531 -0.0132
C  -2.91499 0.005252 0.014801
C  3.558531 -1.173645 0.348836
C  3.559958 1.160781 -0.384405
C  -3.647901 -0.512017 1.12703
C  -3.654699 0.522704 -1.092746
C  4.968158 -1.167464 0.3411
C  4.969538 1.147376 -0.393948
C  -5.057304 -0.513591 1.120891
C  -5.064174 0.521976 -1.078788
C  5.691076 -0.01185 -0.030782
C  -5.78235 0.003384 0.022827
H  1.184636 -1.639716 1.313615
H  1.178319 1.638799 -1.320922
H  -1.289706 -1.704937 1.234992
H  -0.607545 -0.220295 1.954986
H  -1.294323 1.715422 -1.217675
H  -0.628089 0.226166 -1.941937
H  1.511626 -2.33947 -1.204523
H  -0.263219 -2.00484 -1.387684
H  1.534211 2.338613 1.19343
H  -0.239806 2.011089 1.395147
H  3.047299 -2.099388 0.629235
H  3.050027 2.089031 -0.658807
H  -3.124292 -0.892008 2.009578
H  -3.137163 0.905567 -1.977597
H  5.5021 -2.081956 0.623202
H  5.504641 2.059136 -0.682651
H  -5.59182 -0.914117 1.990089
H  -5.604005 0.922525 -1.944721
H  6.785478 -0.014591 -0.037399
H  -6.876984 0.002506 0.025773
