program: Gaussian 09
title: 000025551
version: EM64L-G09RevD.01
frameworkgroup: C1[X(C9H6N2O2)]
method: RPBEPBE
basis: SDD
operation: Freq
keyword: #pfreq=noraman
keyword: PBEPBE/SDD
title: #p freq=noraman PBEPBE/SDD
converged: NO YES YES YES
title: Mulliken charges:
elementType: O O N N C C C C C C C C C H H H H H H
charge: -0.206511 -0.200012 -0.013558 0.031686 0.423807 -0.038465 -0.390167 0.360756 -0.373987 -0.288159 -0.450167 -0.238243 -0.207981 0.299951 0.245888 0.270176 0.293845 0.240247 0.240893
chargesum: 0.00000
title: Mulliken charges with hydrogens summed into heavy atoms:
elementType: O O N N C C C C C C C C C
charge: -0.206511 -0.200012 -0.013558 0.031686 0.423807 -0.038465 -0.090216 0.360756 -0.128099 -0.017983 -0.156321 0.002004 0.032911
polarizability: 2.09051182e+02 7.84824763e+00 1.24018729e+02 -6.09095935e-04 -1.17016130e-03 4.41500176e+01
1716.lowfreq: -2.4097 -0.0012 -0.0011 -0.0008 11.3187 13.3140 51.6809 88.2375 176.9354
frequency: 51.6702 88.2152 176.9335 181.7583 249.5861 326.8912 364.2510 403.1733 470.5782 481.8230 513.6226 520.7871 587.7047 615.8487 620.7538 701.9428 740.3017 753.2597 771.9536 796.3973 872.8467 884.1978 944.6415 948.8119 954.6494 981.0513 1004.8668 1017.3305 1079.1669 1121.7530 1168.5564 1198.9293 1209.2083 1236.2890 1264.3579 1349.4314 1360.7691 1365.9046 1400.8479 1426.9743 1450.2819 1501.4203 1552.7341 1589.3333 1623.1304 3133.0554 3145.5162 3163.7323 3165.0240 3166.5484 3177.5337
redmass: 11.7789 5.9361 7.9635 3.8032 6.0719 10.5691 5.9098 3.9562 3.0588 3.4069 7.3451 6.9138 7.6002 8.9566 4.0097 4.3552 9.6274 5.6858 1.4521 2.7951 5.7303 1.5159 1.4548 6.0924 1.4506 1.4229 1.3447 2.1871 2.1947 1.8051 1.1397 2.6358 3.8616 2.0251 1.6613 1.9055 4.4926 6.0692 3.5981 3.3309 3.0870 4.1107 7.0946 7.0533 6.5944 1.0874 1.0900 1.0956 1.0924 1.0930 1.0994
irintensity: 0.1266 0.5375 1.3895 0.1017 8.8096 0.5397 3.2087 3.1263 7.2605 5.1795 3.7680 1.9890 7.8380 0.8182 0.0001 0.8335 16.9195 13.4713 67.8877 21.2835 3.0860 3.6194 21.7195 3.2241 6.1114 16.4529 0.1464 2.6515 22.8228 9.4530 2.3483 148.1398 204.6398 34.0996 16.7074 3.8168 7.4459 107.8496 13.8512 15.8899 0.9841 32.5082 23.2207 30.6643 33.7498 0.8360 8.0888 16.2628 0.6866 0.6671 16.1402
temp: 298.150 k
press: 1.00000 atm
elementType: 8 8 7 7 6 6 6 6 6 6 6 6 6 1 1 1 1 1 1
symmnumber: 1
zpe: 352158.8 jmol-1
zpe.correction: 0.134130 hartree
zpe.thermalcorrener: 0.143663 hartree
zpe.thermalcorrenthalpy: 0.144607 hartree
zpe.thermalcorrgfe: 0.098430 hartree
zpe.sumelectzpe: -605.530401 hartree
zpe.sumelectthermal: -605.520868 hartree
zpe.sumelectthermalent: -605.519924 hartree
zpe.sumelectthermalfe: -605.566101 hartree
dipole: -5.6588 -1.5324 0.0012
dipole: 5.8626
quadrupole: -79.1251 -73.1919 -75.8412
quadrupole: 4.7485 0.0051 -0.0007
quadrupole: -3.0724 2.8608 0.2116 4.7485 0.0051 -0.0007
hfenergy: -605.6645309 hartree
pointgroup: C01 [X(C9H6N2O2)]
dipole: -2.2253748 -0.6063864 0.0004637 debye
dipolederiv: -0.7108272 0.1572905 0.000014 0.3309872 -0.7213711 0.0001749 0.0002643 -0.0002866 -0.2318039 -0.8613034 -0.2088155 -0.0000491 -0.1812684 -0.5819773 -0.000135 0.000252 0.0002023 -0.224149 -0.5465293 -0.0149911 0.0000131 0.0138271 -0.2466702 -0.0000094 0.0000367 0.0000011 -0.2472695 1.9935258 -0.0109611 -0.0000915 -0.2577826 1.0847924 -0.0000169 -0.0002402 0.0000589 0.1994555 -0.356764 0.095447 -0.0000152 0.3149913 -0.1426281 0.0000324 0.0000301 -0.0000145 0.0625501 0.5367958 0.1674451 0.0000048 -0.2170561 0.0067952 -0.0000095 0.000035 0.0000047 0.0676257 0.5453922 -0.0351128 0.0000267 0.1923468 0.055578 -0.0000322 -0.0001402 0.00002 -0.0781795 -0.8949159 0.0132412 0.0000821 -0.1079888 -0.1424721 -0.0000143 -0.0001056 0.0000424 0.091888 0.0236523 -0.1041925 0.0000122 0.0758231 0.105057 -0.0000185 0.0000323 -0.0000187 -0.1533905 -0.3604095 -0.1141254 0.0000077 -0.158645 0.1152824 -0.0000097 -0.0000472 0.0000068 -0.1358007 0.2376805 -0.014007 0.0000216 -0.1513276 0.2796675 0.000023 -0.000109 -0.0000212 -0.0213248 -0.014105 0.1748586 0.0000035 0.1724482 0.0295027 0.0000002 -0.0000212 0.0000064 -0.1397035 0.1962371 -0.0858817 0.0000233 -0.0172954 0.0376133 -0.0000139 0.0000169 -0.0000157 -0.1312755 0.1236316 0.0077344 -0.000006 0.0166915 0.0427909 0.0000095 -0.0000225 0.0000083 0.1596501 0.0666694 0.0707423 -0.0000091 0.0011267 -0.068609 0.0000102 0.0000089 0.000006 0.1598655 0.0856618 0.0038337 -0.000005 0.0588697 -0.0250778 0.0000093 -0.0000065 0.0000063 0.1624467 0.0538974 -0.0591816 -0.0000086 -0.0318463 0.0892172 -0.0000063 0.0000311 -0.0000142 0.1383946 -0.0232769 -0.0965997 -0.0000068 -0.1056986 0.0022005 -0.0000001 -0.0000103 0.0000041 0.1628761 -0.0950129 0.0532756 -0.0000178 0.0517971 0.0803083 0.0000063 -0.0000045 0.0000037 0.1581448 unknown
polarizability: 209.0262959|7.9818857|124.0436155|-0.0006073|-0.0011711|44.1500176 unknown
InChI: InChI=1S/C9H6N2O2/c12-11(13)8-5-7-3-1-2-4-9(7)10-6-8/h1-6H
charge 0 multiplicity 1
19 atoms
O  3.28603 -1.531689 -0.000274
O  3.799952 0.693665 -0.000351
N  -0.179437 1.80056 0.000058
N  2.954264 -0.282516 0.000327
C  -0.813149 -0.614425 0.000092
C  -1.149017 0.799188 0.000024
C  0.568893 -0.970069 0.000191
C  1.514864 0.055097 0.000227
C  -1.864404 -1.588663 0.000058
C  -2.523396 1.187479 -0.000081
C  1.1111 1.431408 0.000148
C  -3.199057 -1.178963 -0.000044
C  -3.528587 0.214965 -0.000117
H  0.893675 -2.0152 0.000253
H  -1.606339 -2.654029 0.000112
H  -2.751032 2.257442 -0.000131
H  1.870788 2.218468 0.000174
H  -4.002493 -1.922752 -0.00007
H  -4.581056 0.518135 -0.000197
