program: Gaussian 09
title: 000279891
version: EM64L-G09RevD.01
frameworkgroup: C1[X(C10H19NO2)]
method: RPBEPBE
basis: SDD
operation: Freq
keyword: #p
keyword: freq=noraman
keyword: PBEPBE/SDD
title: #p freq=noraman PBEPBE/SDD
converged: YES YES NO NO
title: Mulliken charges:
elementType: O O N C C C C C C C C C C H H H H H H H H H H H H H H H H H H H
charge: -0.490290 -0.336274 -0.132405 0.362950 -0.464070 -0.504412 -0.404114 -0.386735 -0.390100 -0.615331 0.295412 -0.624786 -0.636268 0.209347 0.180842 0.177983 0.239252 0.230944 0.184445 0.186522 0.217071 0.179339 0.200858 0.227985 0.254309 0.363025 0.288077 0.224233 0.227248 0.233174 0.237786 0.263981
chargesum: 0.00000
title: Mulliken charges with hydrogens summed into heavy atoms:
elementType: O O N C C C C C C C C C C
charge: -0.127265 -0.336274 -0.132405 0.362950 -0.073881 -0.087176 0.011275 0.016859 -0.009903 -0.133037 0.295412 0.114771 0.098674
polarizability: 1.50105307e+02 -3.11912368e+00 1.10012597e+02 5.60392380e+00 -2.42153061e+00 9.82936372e+01
1716.lowfreq: -21.6533 -4.6885 -0.0003 0.0002 0.0005 14.6365 28.7576 67.8506 78.7970
frequency: 28.5799 67.7323 78.7741 102.9381 135.7393 152.0062 180.6785 207.5221 237.1784 245.4234 258.4621 308.0272 332.8101 387.8648 403.8667 409.0890 430.4084 477.2700 482.7987 549.2031 598.0105 634.7779 705.9053 726.2312 774.0837 793.3373 831.3087 850.2552 875.2058 916.7461 931.2034 947.5339 968.2682 974.8716 1051.5195 1053.5316 1063.9128 1084.0587 1091.2179 1095.7865 1127.2851 1139.8835 1141.4235 1153.2052 1174.4973 1225.9986 1240.4237 1260.8750 1262.1767 1281.4047 1294.5210 1323.9445 1336.8723 1343.6793 1344.1466 1357.1478 1393.4139 1406.3287 1411.2811 1422.7414 1442.8705 1446.9261 1456.8917 1461.2218 1467.8549 1472.3341 1475.2830 1479.5491 1490.7539 1500.0305 1573.7139 2955.4292 2955.6610 2962.6381 2965.2245 2969.7825 2974.0641 2984.6406 2987.8729 3024.0674 3029.0210 3034.6372 3038.9237 3046.6463 3047.4003 3050.2397 3056.4244 3117.2901 3123.8892 3329.3044
redmass: 2.5095 2.4354 1.6150 2.8387 3.2557 1.1906 2.5903 2.4115 3.0306 2.6572 3.5561 2.5739 2.3615 3.2583 2.2268 2.4294 2.9832 2.6642 2.1922 3.1135 3.7836 2.9750 1.2483 2.6220 1.8373 3.4168 2.6449 1.6593 2.5678 2.1227 1.5579 2.6147 2.4028 2.0560 1.3877 2.0300 1.6042 1.8326 1.2419 1.6281 1.6569 1.7357 1.4191 1.6887 1.7661 1.3830 4.9495 1.3605 1.2611 1.4458 1.4851 1.3698 1.4274 1.4225 1.4492 1.4492 2.2346 1.7485 1.1896 1.1188 1.2155 1.0917 1.0882 1.1004 1.0824 1.0674 1.0960 1.0634 1.0480 1.2471 4.4161 1.0637 1.0636 1.0616 1.0404 1.0614 1.0366 1.0621 1.0631 1.0962 1.0976 1.0966 1.0971 1.1023 1.0972 1.1013 1.1020 1.0968 1.0974 1.0649
irintensity: 1.2378 0.3912 0.3312 2.6150 0.9070 0.3619 3.1859 1.1744 1.5773 7.8039 3.6461 2.3918 0.7048 24.2656 3.6161 3.4882 5.2144 3.1275 4.6027 4.4563 8.4105 9.2519 186.5681 29.6144 1.0331 6.6735 5.6623 5.7813 6.6110 12.2013 1.9644 9.6078 8.2313 33.7406 7.7214 3.2005 7.4761 17.0903 1.7988 5.0599 87.7090 19.3850 5.6294 35.1364 36.9218 7.6774 27.0696 7.0714 8.1775 24.2381 16.8275 8.4896 1.9817 0.9571 1.8766 11.6100 127.4429 88.2342 40.5466 38.1892 6.9793 12.4294 8.5048 2.3815 15.3450 11.9163 10.6362 8.6670 27.5987 21.3061 224.3415 19.7581 34.8397 20.1636 49.5643 51.0009 86.6729 35.4055 49.9089 77.5522 28.4494 42.3642 9.0726 15.3067 47.7296 15.0492 87.4885 15.1098 0.9954 204.6787
temp: 298.150 k
press: 1.00000 atm
elementType: 8 8 7 6 6 6 6 6 6 6 6 6 6 1 1 1 1 1 1 1 1 1 1 1 1 1 1 1 1 1 1 1
symmnumber: 1
zpe: 735739.1 jmol-1
zpe.correction: 0.280228 hartree
zpe.thermalcorrener: 0.294422 hartree
zpe.thermalcorrenthalpy: 0.295366 hartree
zpe.thermalcorrgfe: 0.239237 hartree
zpe.sumelectzpe: -596.619279 hartree
zpe.sumelectthermal: -596.605085 hartree
zpe.sumelectthermalent: -596.604141 hartree
zpe.sumelectthermalfe: -596.660270 hartree
dipole: -3.8892 3.1944 -2.8349
dipole: 5.7764
quadrupole: -67.9490 -80.0680 -84.2471
quadrupole: -4.1585 0.6491 1.1588
quadrupole: 9.4724 -2.6466 -6.8257 -4.1585 0.6491 1.1588
hfenergy: -596.8995072 hartree
pointgroup: C01 [X(C10H19N1O2)]
dipole: 1.4899463 1.310587 1.1077859 debye
polarizability: 149.8396652|4.1821764|110.2651204|5.863415|2.4214159|98.3067553 unknown
InChI: InChI=1S/C10H19NO2/c1-11(2)9(12)8-10(13)6-4-3-5-7-10/h13H,3-8H2,1-2H3
charge 0 multiplicity 1
32 atoms
O  -0.900842 -0.644841 -1.450628
O  1.554625 -1.378645 -0.579005
N  2.988129 0.247226 0.242089
C  -0.83387 0.180383 -0.230399
C  -1.89904 1.286704 -0.414728
C  -1.157379 -0.678871 1.026642
C  -3.332238 0.709579 -0.462993
C  -2.589234 -1.258329 0.96641
C  -3.64139 -0.138801 0.793304
C  0.577056 0.833919 -0.116396
C  1.732794 -0.176888 -0.164369
C  4.108005 -0.712833 0.25393
C  3.299745 1.611416 0.699122
H  -1.678053 1.83194 -1.352659
H  -1.814261 2.009891 0.423579
H  -1.056443 -0.043205 1.932281
H  -0.417027 -1.496487 1.111405
H  -3.421354 0.073312 -1.363407
H  -4.064026 1.534915 -0.56401
H  -2.794125 -1.846482 1.882244
H  -2.652744 -1.951849 0.105757
H  -3.63707 0.51437 1.692256
H  -4.656539 -0.574823 0.718144
H  0.623689 1.429602 0.814775
H  0.698656 1.540492 -0.963709
H  -0.121049 -1.274067 -1.381092
H  3.722551 -1.696676 -0.051583
H  4.542703 -0.784229 1.269089
H  4.900305 -0.396206 -0.45071
H  4.293637 1.903964 0.314383
H  3.326531 1.677011 1.805387
H  2.566455 2.337509 0.319394
