program: Gaussian 09
title: 000279845
version: EM64L-G09RevD.01
frameworkgroup: C1[X(C9H7NO3)]
method: RPBEPBE
basis: SDD
operation: Freq
keyword: #pfreq=noraman
keyword: PBEPBE/SDD
title: #p freq=noraman PBEPBE/SDD
converged: YES YES YES YES
title: Mulliken charges:
elementType: O O O N C C C C C C C C C H H H H H H H
charge: -0.247300 -0.216028 -0.222164 0.038224 0.201656 0.065406 0.170189 0.307347 -0.361709 -0.339599 -0.761602 -0.230932 -0.205413 0.291588 0.260217 0.246230 0.266355 0.266337 0.234556 0.236643
chargesum: 0.00000
title: Mulliken charges with hydrogens summed into heavy atoms:
elementType: O O O N C C C C C C C C C
charge: -0.247300 -0.216028 -0.222164 0.038224 0.201656 0.065406 0.170189 0.307347 -0.070121 -0.079382 0.017321 0.003624 0.031230
polarizability: 1.71803964e+02 -6.83758964e+00 1.31380935e+02 -7.90475145e-03 1.67158205e-02 4.86110473e+01
1716.lowfreq: -0.0004 0.0008 0.0011 3.5298 6.5702 9.6109 68.4405 105.3365 120.4618
frequency: 68.3869 105.2646 120.4617 135.3539 169.2093 256.0919 292.1477 310.8765 372.2003 395.9119 432.1914 482.4698 565.5558 571.7927 603.7060 623.6509 662.6274 703.3680 747.1898 747.3153 765.2942 824.4341 871.1137 910.0859 952.9287 988.6360 992.6098 1010.2118 1034.1657 1079.1678 1099.5112 1151.1525 1169.8184 1231.3205 1233.9944 1283.6611 1335.7088 1364.4166 1406.2611 1415.3184 1434.5643 1442.7424 1456.3252 1470.2604 1568.9008 1600.6726 1630.3468 3001.3920 3079.3482 3121.7344 3143.7777 3161.7152 3181.2390 3194.6441
redmass: 4.6138 1.1893 4.6779 3.8416 8.1692 3.1054 7.3542 4.6010 8.6310 8.2292 3.0655 5.7167 4.0094 5.1628 5.8055 8.0016 6.1349 7.4617 11.6429 5.2176 1.2963 6.7767 1.3463 3.4367 1.3676 3.3429 1.3127 1.9914 1.4779 3.1796 2.8753 1.7378 1.2647 6.3508 3.1868 1.7767 8.4160 5.3879 1.4974 2.8631 2.7557 1.0434 1.0922 3.1391 9.0099 7.8877 8.2828 1.0370 1.0960 1.1008 1.0870 1.0924 1.0974 1.0964
irintensity: 0.0221 0.4720 2.2063 2.9669 3.4349 3.9773 2.2716 0.3283 0.0722 0.4719 7.0505 0.2825 0.0592 3.3153 4.6574 2.2500 5.4481 0.0613 18.1627 1.6191 106.1023 9.4656 0.5779 32.8230 4.3671 21.3632 0.2469 8.8275 7.5630 7.3922 65.8499 36.5403 38.0654 74.7644 20.5287 59.5859 123.2038 120.9393 14.4990 8.5439 31.9071 18.6050 6.3512 30.1761 110.8539 3.7353 3.6923 1.1569 2.2094 9.1053 4.3345 14.0774 6.0461 4.2577
temp: 298.150 k
press: 1.00000 atm
elementType: 8 8 8 7 6 6 6 6 6 6 6 6 6 1 1 1 1 1 1 1
symmnumber: 1
zpe: 376663.7 jmol-1
zpe.correction: 0.143464 hartree
zpe.thermalcorrener: 0.154028 hartree
zpe.thermalcorrenthalpy: 0.154972 hartree
zpe.thermalcorrgfe: 0.106895 hartree
zpe.sumelectzpe: -626.576443 hartree
zpe.sumelectthermal: -626.565879 hartree
zpe.sumelectthermalent: -626.564935 hartree
zpe.sumelectthermalfe: -626.613011 hartree
dipole: 3.0897 3.2684 0.0005
dipole: 4.4976
quadrupole: -71.2084 -74.7737 -75.6935
quadrupole: -10.4882 -0.0019 0.0002
quadrupole: 2.6835 -0.8818 -1.8017 -10.4882 -0.0019 0.0002
hfenergy: -626.7199064 hartree
pointgroup: C01 [X(C9H7N1O3)]
dipole: -1.2735356 -1.2285165 0.0002078 debye
dipolederiv: -1.008675 -0.248594 0.0000321 0.0357357 -0.5039727 0.000058 -0.0000054 0.0000825 -0.1453698 -0.4475964 0.0517173 -0.0000252 -0.0573054 -0.8657396 0.0001279 -0.0000132 0.0001863 -0.2390839 -1.0501392 -0.0148532 -0.0000881 0.0874489 -0.4344026 0.0000663 -0.0000326 0.0000291 -0.233441 1.5313963 0.2886196 0.000069 0.3663835 1.4105068 -0.0002647 0.0000245 -0.0002586 0.1976067 0.2294236 -0.083881 0.0000186 -0.0337945 -0.1819346 0.0000313 0.0000215 0.0000495 0.0398592 -0.2870767 -0.1539812 0.0000291 -0.5033956 -0.7807772 0.0001399 0.0000502 0.0001112 -0.0200362 0.4024203 0.0140669 0.0000077 -0.4791654 0.1207888 -0.0000179 0.0000846 -0.0000153 0.0482671 0.655663 -0.037324 0.0000035 0.4090811 0.9564899 -0.0001452 -0.0000273 -0.0002774 0.1126794 -0.0615245 0.0178189 -0.0000024 0.0285963 0.0813132 -0.0000394 -0.0000024 -0.0000405 -0.1372656 -0.0469591 0.0038775 0.0000031 0.1179542 0.0395298 -0.0000342 -0.0000194 -0.0000376 -0.1485582 -0.2411186 0.2890886 -0.0000355 0.0960774 0.0043467 0.0000275 -0.0000938 0.0002066 -0.0012658 -0.0149677 -0.0522001 0.0000151 -0.1100059 0.1196788 -0.0000562 0.0000227 -0.0000565 -0.1574274 0.0451565 0.0370855 0.0000002 0.0396598 -0.062258 -0.0000169 -0.0000031 -0.0000149 -0.1649376 0.1037174 -0.073991 0.0000135 -0.0191675 0.0359294 0.0000241 0.000002 0.0000258 0.1720626 0.0837246 -0.0325909 0.0000026 -0.0623982 -0.0186578 0.000036 0.0000098 0.0000356 0.18397 0.0892568 -0.0878179 -0.00003 -0.0065779 -0.0718551 -0.0000424 -0.0000023 -0.0000818 0.1336422 0.0602344 0.0047066 0.0600001 0.0001084 0.0467931 0.0525207 0.0673063 0.0204411 0.0158354 0.060239 0.004774 -0.0599855 0.0001968 0.0467801 -0.0524677 -0.0672932 -0.020438 0.0157079 0.0079796 0.0921714 -0.000022 0.1029965 -0.0340616 0.0000404 -0.0000233 0.0000397 0.1630621 -0.1111543 -0.0186929 -0.0000058 -0.0124282 0.0915025 0.0000125 -0.0000056 0.0000133 0.1646926 unknown
polarizability: 171.0889627|-8.6685595|132.0959359|0.0071264|-0.0170622|48.6110473 unknown
InChI: InChI=1S/C9H7NO3/c1-6-9(10(11)12)7-4-2-3-5-8(7)13-6/h2-5H,1H3
charge 0 multiplicity 1
20 atoms
O  -0.115237 -1.932895 0.000475
O  1.680962 2.309855 -0.000349
O  3.237819 0.628657 0.000195
N  2.009156 1.055076 0.000063
C  -0.480206 0.368732 0.000034
C  0.947747 0.087018 0.00015
C  -1.106023 -0.907202 0.00025
C  1.137172 -1.298431 0.000368
C  -1.289184 1.53026 -0.000212
C  -2.489797 -1.109347 0.000237
C  2.335919 -2.179482 0.00054
C  -2.690182 1.355094 -0.000227
C  -3.283616 0.061485 -0.000008
H  -0.831258 2.521455 -0.000385
H  -2.92584 -2.111578 0.000411
H  2.026939 -3.236691 0.000274
H  2.969935 -1.976414 -0.880394
H  2.96944 -1.976765 0.881919
H  -3.338911 2.237248 -0.000413
H  -4.374435 -0.031873 -0.000026
