program: Gaussian 09
title: 000025703
version: EM64L-G09RevD.01
frameworkgroup: C1[X(C14H26N4O2S4)]
method: RPBEPBE
basis: SDD
operation: Freq
keyword: #p
keyword: freq=noraman
keyword: PBEPBE/SDD
title: #p freq=noraman PBEPBE/SDD
converged: YES YES NO NO
title: Mulliken charges:
elementType: S S S S O O N N N N C C C C C C C C C C C C C C H H H H H H H H H H H H H H H H H H H H H H H H H H
charge: 0.108219 0.104019 0.074675 0.067709 -0.456433 -0.454856 -0.085663 -0.087319 0.082626 0.081581 -0.339880 -0.352575 -0.343031 -0.355107 -0.415203 -0.383753 -0.387362 -0.405957 -0.320114 -0.322159 -0.585960 -0.586277 -0.332770 -0.328396 0.227665 0.196672 0.231159 0.188161 0.219374 0.187389 0.198043 0.239014 0.266752 0.238686 0.238822 0.246601 0.247722 0.238105 0.238514 0.263134 0.226139 0.198449 0.202465 0.228186 0.196718 0.207837 0.208400 0.190402 0.349849 0.349729
chargesum: 0.00000
title: Mulliken charges with hydrogens summed into heavy atoms:
elementType: S S S S O O N N N N C C C C C C C C C C C C C C
charge: 0.108219 0.104019 0.074675 0.067709 -0.106585 -0.105127 -0.085663 -0.087319 0.082626 0.081581 0.084457 0.066745 0.063732 0.081950 0.090235 0.101670 0.098464 0.095692 0.104474 0.108492 -0.585960 -0.586277 0.071785 0.070406
polarizability: 2.56802743e+02 -7.50054404e+00 2.40709854e+02 -3.34014002e+01 6.67041310e+00 3.79520854e+02
1716.lowfreq: -12.5673 -10.5756 -8.9302 -4.5702 -0.0034 -0.0031 -0.0031 6.3226 13.9443
frequency: -10.9375 -5.5617 13.6829 22.9375 30.8005 39.2223 45.7623 53.1930 60.5171 68.9379 74.6958 91.0951 102.0899 134.3810 145.3685 152.9696 168.0670 189.7726 223.3883 231.2008 233.5251 251.0147 262.0392 263.0212 269.4027 272.7697 292.6623 318.7906 325.0143 332.2880 347.9658 357.2063 397.1355 408.3358 413.5059 416.2959 424.3056 432.9956 467.3196 467.9098 517.2975 525.6947 554.9432 558.8489 630.8698 633.4364 764.6820 765.9189 812.0714 815.1360 825.9085 828.0546 832.4119 835.6386 886.1279 891.1076 958.5951 959.7189 976.0435 977.1143 991.1329 992.0230 1023.2827 1027.4823 1037.6964 1040.6367 1041.4675 1044.2690 1073.7503 1077.1808 1099.8598 1103.2463 1134.8058 1135.0498 1142.4097 1144.7319 1168.2296 1168.4793 1191.7853 1193.3023 1208.0330 1208.0645 1224.4433 1229.9520 1234.7925 1242.0867 1266.9588 1267.4592 1284.0351 1286.1134 1294.5298 1294.8024 1329.3599 1330.0155 1332.0109 1333.2681 1353.0956 1354.1060 1356.4013 1357.4326 1380.3317 1381.8795 1418.3388 1420.5585 1448.5711 1449.2960 1451.2391 1452.6456 1455.0046 1455.4913 1460.9321 1463.8164 1473.1436 1473.6861 1484.9748 1486.9042 1488.8721 1495.0535 2836.4769 2842.1444 2858.4170 2865.0067 2888.7579 2898.2634 2948.5489 2951.7582 2997.1285 2997.7660 3003.6226 3004.2772 3008.1736 3008.3051 3041.3546 3047.2221 3051.6293 3053.3018 3057.7121 3059.6410 3088.7335 3090.0328 3104.7877 3112.8058 3579.1199 3579.9874
redmass: 5.8852 4.5017 5.8361 5.0541 3.7731 3.4959 5.0227 2.6452 7.1539 4.8414 4.6835 3.6958 4.0223 4.5846 12.1556 5.3070 5.1845 6.2100 3.0042 3.9234 5.5537 5.1509 1.0824 1.0828 3.1181 2.5961 10.2552 2.5188 2.7659 6.5595 3.0546 2.9241 3.4752 2.6328 2.7429 6.0134 3.9996 3.7966 2.8073 2.7858 6.5114 6.9859 5.4855 5.3264 2.1181 2.1363 3.7888 3.8601 1.5141 1.2115 3.1535 1.6827 1.8346 2.0121 4.4465 4.6157 2.8600 2.9028 4.5953 4.6462 2.9380 2.9658 2.3625 2.3646 2.0544 2.1901 1.8561 1.7827 1.8627 1.8802 2.2144 2.0844 3.2475 3.0958 2.7125 2.7790 1.7961 1.7838 1.0652 1.0618 1.3488 1.3276 1.4358 1.5876 1.4619 1.4744 1.2890 1.2936 1.2478 1.2538 1.3258 1.3185 1.3113 1.2935 1.2630 1.2887 1.3690 1.3569 1.3941 1.3700 1.4104 1.4152 1.4822 1.4780 1.4902 1.3995 1.0813 1.0843 1.0829 1.0997 1.1003 1.0945 1.0814 1.0839 1.0835 1.0850 1.9671 2.2682 1.0714 1.0711 1.0703 1.0702 1.0696 1.0700 1.0575 1.0559 1.0658 1.0666 1.0637 1.0639 1.1026 1.1015 1.0888 1.0872 1.0925 1.0916 1.0917 1.0893 1.1007 1.1007 1.0979 1.0967 1.0667 1.0667
irintensity: 0.4384 0.9835 0.1782 0.2138 4.1267 2.7568 5.0972 10.5112 1.5162 3.6809 1.6325 0.3731 0.8298 1.2230 0.4667 3.0596 9.1000 2.4302 11.3264 17.9931 9.3631 0.3676 164.8447 124.1791 0.2746 2.0426 33.2730 9.2087 9.6000 2.5306 18.0014 14.8801 3.8569 7.0338 6.9301 7.9448 3.9443 8.7572 0.4872 0.3072 4.1997 0.0003 0.6910 0.5465 0.2593 4.1581 9.1836 14.9420 6.1140 0.3889 18.2313 13.6651 1.3360 7.3751 50.9368 9.4912 3.5594 34.2977 94.3904 193.4515 13.8762 7.6820 39.0878 23.4975 12.5094 7.0123 3.7062 3.3034 3.0308 2.2722 13.0582 10.7865 25.6842 18.1131 40.9217 33.5922 9.3569 4.3878 2.3485 1.7628 34.5318 38.0551 60.9846 32.1301 30.8540 48.8129 11.0574 15.5685 31.3335 9.1209 40.9619 24.3462 5.9716 9.2656 2.1210 0.1378 9.9147 7.2223 0.8315 5.2071 3.8528 3.5198 0.4259 0.6826 108.8576 107.0071 3.9281 8.7408 6.4912 13.0663 2.8261 0.6939 2.6891 7.7216 7.6861 10.3792 238.7507 55.7325 76.4704 52.9651 141.5313 24.9131 95.4032 64.2751 55.6837 56.2234 38.7261 18.6047 40.4830 31.3389 84.2024 24.1110 21.9297 31.8573 62.3632 11.9418 54.6856 17.4644 6.1829 5.8746 2.0793 1.1602 5.2547 4.6239
temp: 298.150 k
press: 1.00000 atm
elementType: 16 16 16 16 8 8 7 7 7 7 6 6 6 6 6 6 6 6 6 6 6 6 6 6 1 1 1 1 1 1 1 1 1 1 1 1 1 1 1 1 1 1 1 1 1 1 1 1 1 1
symmnumber: 1
zpe: 1059201.7 jmol-1
zpe.correction: 0.403429 hartree
zpe.thermalcorrener: 0.429807 hartree
zpe.thermalcorrenthalpy: 0.430751 hartree
zpe.thermalcorrgfe: 0.343660 hartree
zpe.sumelectzpe: -2508.825039 hartree
zpe.sumelectthermal: -2508.798661 hartree
zpe.sumelectthermalent: -2508.797717 hartree
zpe.sumelectthermalfe: -2508.884808 hartree
dipole: -4.4917 3.6238 0.3855
dipole: 5.7841
quadrupole: -165.2695 -169.3328 -194.3605
quadrupole: 24.6852 -2.6204 4.0259
quadrupole: 11.0515 6.9881 -18.0396 24.6852 -2.6204 4.0259
hfenergy: -2509.2284681 hartree
pointgroup: C01 [X(C14H26N4O2S4)]
dipole: -0.3240448 1.9936042 1.0483648 debye
polarizability: 243.7114335|1.636705|255.7881818|-27.2429503|-27.5082295|377.533835 unknown
InChI: InChI=1S/2C7H13N2OS2/c2*10-6-5-8-1-3-9(4-2-8)7(11)12/h2*10H,1-6H2
charge 0 multiplicity 1
50 atoms
S  0.546727 -3.127333 -2.278438
S  0.347945 -3.721826 0.170103
S  0.962563 -1.209706 -4.384383
S  -0.254301 -2.933372 2.882215
O  3.220469 3.220182 3.171614
O  -3.973332 4.114843 -0.853627
N  2.806676 1.175941 0.069142
N  -2.812585 0.614537 -0.245843
N  2.146274 -0.809378 -1.927493
N  -1.664439 -1.825569 0.790013
C  2.304338 -0.164203 0.462267
C  2.263184 1.56764 -1.254152
C  -2.255767 0.550509 1.126356
C  -2.106302 -0.333302 -1.142686
C  2.671451 -1.21586 -0.599638
C  2.639413 0.534304 -2.333564
C  -2.356089 -0.875462 1.70193
C  -2.20761 -1.76684 -0.591191
C  2.569175 2.211649 1.104583
C  -2.864531 1.994874 -0.787717
C  1.354897 -1.554343 -2.738006
C  -0.691058 -2.65981 1.233567
C  3.552965 2.099126 2.277199
C  -4.079763 2.771451 -0.262018
H  2.758679 -0.466859 1.421004
H  1.193274 -0.161654 0.605122
H  2.689906 2.546193 -1.539476
H  1.147351 1.675465 -1.234403
H  -2.821442 1.232727 1.785328
H  -1.181837 0.873701 1.150365
H  -1.025926 -0.069236 -1.270424
H  -2.576269 -0.305027 -2.141369
H  2.270158 -2.19925 -0.316326
H  3.773367 -1.284527 -0.6838
H  3.739441 0.485989 -2.442612
H  2.193713 0.796791 -3.306294
H  -1.887337 -0.93512 2.697304
H  -3.417335 -1.177171 1.786384
H  -3.272876 -2.064879 -0.541909
H  -1.665854 -2.467176 -1.242226
H  2.711768 3.206647 0.645464
H  1.525738 2.180499 1.503864
H  -1.939155 2.576637 -0.558678
H  -2.947721 1.940289 -1.887821
H  3.438075 1.129509 2.80586
H  4.590505 2.174571 1.892588
H  -5.009389 2.25532 -0.577034
H  -4.065517 2.829021 0.847369
H  3.823285 3.208357 3.956152
H  -4.761302 4.655032 -0.596166
