program: Gaussian 09
title: 000279896
version: EM64L-G09RevD.01
frameworkgroup: C1[X(C15H24N2O2)]
method: RPBEPBE
basis: SDD
operation: Freq
keyword: #p
keyword: freq=noraman
keyword: PBEPBE/SDD
title: #p freq=noraman PBEPBE/SDD
converged: YES YES NO NO
title: Mulliken charges:
elementType: O O N N C C C C C C C C C C C C C C C H H H H H H H H H H H H H H H H H H H H H H H H
charge: -0.413294 -0.279261 -0.080354 -0.150282 0.117965 -0.471184 0.323539 -0.422627 -0.406509 0.171903 -0.388248 -0.395508 -0.618933 -0.624147 -0.253643 -0.252602 -0.619481 -0.632869 -0.242347 0.209961 0.232185 0.268079 0.183244 0.254813 0.196738 0.287210 0.242809 0.346544 0.228302 0.189903 0.219305 0.221050 0.188505 0.227429 0.231267 0.225717 0.285898 0.220375 0.219854 0.269465 0.228391 0.229893 0.230946
chargesum: 0.00000
title: Mulliken charges with hydrogens summed into heavy atoms:
elementType: O O N N C C C C C C C C C C C C C C C
charge: -0.066750 -0.279261 -0.080354 -0.150282 0.117965 -0.029038 0.323539 0.028696 0.045042 0.171903 -0.101037 -0.152699 0.018576 0.012836 -0.022376 -0.026886 0.106645 0.094881 -0.011401
polarizability: 2.12104390e+02 -5.91564594e+00 1.74959018e+02 -1.08893688e+01 9.78222620e+00 1.52079188e+02
1716.lowfreq: -16.2669 -14.4156 -7.0269 -0.0006 -0.0004 0.0003 3.7994 22.0330 45.8609
frequency: -14.8450 21.3473 45.8393 61.8283 67.9512 74.5776 91.3429 106.4019 109.6951 129.1150 135.2252 173.5215 200.3719 217.5307 223.4394 239.6527 251.8532 261.1878 279.1768 291.0932 316.4044 321.8000 348.1543 382.8972 403.0529 411.6817 423.1836 431.1335 442.0956 485.3754 546.7418 593.5874 611.5309 616.8133 672.4956 707.5545 717.7410 765.7279 774.6662 805.9108 829.6517 858.0419 914.2249 924.1876 949.5206 974.3605 980.1683 990.1709 993.8219 998.8661 1025.1078 1031.5291 1035.7250 1044.9384 1058.8192 1073.1392 1078.8554 1090.8456 1091.5826 1104.5371 1124.1135 1144.4801 1146.1625 1173.1323 1175.4551 1189.1808 1198.0566 1227.5399 1237.5914 1249.1326 1264.2273 1308.3391 1314.7948 1324.8592 1339.8356 1369.9784 1372.5596 1381.2329 1386.3375 1405.7794 1418.2191 1432.6004 1436.6336 1441.2483 1442.7951 1456.1482 1461.1062 1464.8954 1468.6142 1473.6670 1476.2475 1480.3434 1483.9815 1486.2741 1491.8455 1498.7466 1564.6006 1583.8380 1608.1113 2844.9732 2851.2230 2868.1587 2947.6619 2960.2853 2968.1208 2986.1166 3019.5072 3027.2848 3027.8736 3032.3590 3040.8670 3056.0010 3078.1288 3084.0528 3112.6981 3124.5024 3124.6094 3132.5021 3147.1836 3154.9543 3155.0281 3166.5645 3531.1279
redmass: 2.2978 2.2592 3.1141 3.6725 3.7592 3.6367 3.2759 2.4086 2.5038 2.5464 1.2864 3.4257 2.5501 1.4290 2.2141 2.1387 1.4753 3.6006 2.6013 2.6056 3.0479 2.9517 2.5517 1.4481 2.6356 2.8144 2.4082 2.6301 3.1373 3.5067 4.3255 3.8948 4.4369 6.3004 5.5920 1.6578 6.0495 2.0051 2.0658 1.8636 2.8947 1.2603 1.9845 2.0412 2.7949 1.9745 1.5276 4.3817 3.5574 1.5735 2.5955 1.6463 1.9034 1.3847 3.2190 2.0141 2.0285 1.3804 1.2295 2.3027 1.6495 1.4125 1.7547 1.3370 1.2786 2.2341 1.1425 4.5483 1.6625 1.8324 2.3953 1.4685 1.2127 1.3689 1.2190 3.8071 2.5729 1.3000 1.4267 1.1743 1.1433 2.0516 1.2129 1.1611 1.1087 1.0793 1.0512 1.0597 1.0716 1.0689 1.0553 1.0854 1.9315 1.0879 1.0522 1.2056 5.5926 5.8555 5.8829 1.0578 1.0655 1.0609 1.0694 1.0395 1.0374 1.0602 1.0729 1.0727 1.1007 1.0862 1.1013 1.1005 1.1010 1.1003 1.0933 1.0847 1.0967 1.0882 1.0926 1.0939 1.0931 1.1008 1.0654
irintensity: 1.5014 2.1759 0.0586 0.1351 0.6615 0.2301 1.5644 2.5675 1.0229 0.4880 0.2780 1.2891 3.1048 1.2176 0.9669 0.3200 1.2624 0.7166 9.0733 1.4350 5.7904 4.1523 1.6132 105.8054 5.9683 6.1543 89.5674 4.4968 13.1079 4.5886 13.8675 9.7816 29.1697 1.1282 4.6061 48.0044 2.6788 6.1565 17.3951 15.6139 10.4104 1.0055 7.7982 1.7980 6.5196 13.7436 3.0614 2.8501 65.7446 21.9886 20.0977 25.6540 23.0680 9.8051 2.3212 7.7175 45.1633 5.6973 0.5751 4.7690 81.3557 0.8320 16.2848 8.4780 6.2946 12.4406 0.3228 31.3675 16.5425 4.1591 2.3755 21.4617 2.8533 0.6207 3.8500 28.2429 21.7440 5.9832 6.6851 43.5838 2.7395 8.9996 5.7308 7.0132 15.2045 9.9730 16.8400 1.4632 13.0877 6.0632 14.0571 7.0143 21.5682 22.1479 30.5994 18.1784 224.7146 8.5206 8.0788 73.7309 61.5492 197.2188 66.1783 29.5998 103.4259 19.8734 40.3147 50.3816 35.6429 2.6095 31.7612 39.9740 28.9442 56.3248 3.6153 1.4517 1.7123 5.9274 19.5624 11.6190 21.6595 16.5469 4.5755
temp: 298.150 k
press: 1.00000 atm
elementType: 8 8 7 7 6 6 6 6 6 6 6 6 6 6 6 6 6 6 6 1 1 1 1 1 1 1 1 1 1 1 1 1 1 1 1 1 1 1 1 1 1 1 1
symmnumber: 1
zpe: 961512.2 jmol-1
zpe.correction: 0.366221 hartree
zpe.thermalcorrener: 0.386831 hartree
zpe.thermalcorrenthalpy: 0.387776 hartree
zpe.thermalcorrgfe: 0.316783 hartree
zpe.sumelectzpe: -844.427165 hartree
zpe.sumelectthermal: -844.406554 hartree
zpe.sumelectthermalent: -844.405610 hartree
zpe.sumelectthermalfe: -844.476603 hartree
dipole: 0.4586 -1.7363 -4.5389
dipole: 4.8812
quadrupole: -103.0309 -108.6487 -128.9568
quadrupole: 1.7628 -4.2057 -7.6903
quadrupole: 10.5146 4.8968 -15.4114 1.7628 -4.2057 -7.6903
hfenergy: -844.7933857 hartree
pointgroup: C01[X(C15H24N2O2)]
dipole: 0.2033233 -0.8154364 -1.7267785 debye
polarizability: 212.4494508|-5.8503176|176.0240545|-10.5055132|7.6139402|150.6690906 unknown
InChI: InChI=1S/C15H24N2O2/c1-16(2)11-10-15(12-18,14(19)17(3)4)13-8-6-5-7-9-13/h5-9,18H,10-12H2,1-4H3
charge 0 multiplicity 1
43 atoms
O  1.150471 0.015728 2.857338
O  -0.703976 2.177398 1.321698
N  -3.650297 -0.985151 -0.514094
N  -0.042823 2.067077 -0.891719
C  0.004827 -0.05489 0.552872
C  -1.179149 -0.843706 -0.106786
C  1.385485 -0.50634 0.039622
C  -0.042375 -0.359102 2.104224
C  -2.586425 -0.363339 0.314957
C  -0.250846 1.481116 0.35664
C  2.520201 0.322839 0.271541
C  1.59794 -1.770029 -0.573025
C  -4.936964 -0.269919 -0.373378
C  -3.811914 -2.433543 -0.268078
C  3.814464 -0.09036 -0.113175
C  2.893719 -2.185706 -0.956155
C  -0.308352 3.512276 -1.03732
C  0.34693 1.401246 -2.144158
C  4.009193 -1.348384 -0.729383
H  -1.065628 -1.912527 0.158565
H  -1.128085 -0.778074 -1.209386
H  -0.844101 0.241135 2.557436
H  -0.253433 -1.444225 2.222365
H  -2.656924 0.730576 0.176251
H  -2.750644 -0.557251 1.405851
H  2.380434 1.300551 0.744834
H  0.752948 -2.438388 -0.76505
H  1.928888 -0.487341 2.503384
H  -4.801128 0.794713 -0.633703
H  -5.364239 -0.320247 0.660596
H  -5.679233 -0.700954 -1.069334
H  -4.603741 -2.831305 -0.927622
H  -4.092277 -2.669189 0.791247
H  -2.879141 -2.973466 -0.503961
H  4.670553 0.568119 0.072978
H  3.030106 -3.163869 -1.431457
H  -0.577115 3.920371 -0.052333
H  -1.143208 3.685505 -1.744325
H  0.592343 4.026722 -1.42368
H  0.583807 0.343142 -1.987894
H  1.247214 1.887902 -2.567595
H  -0.471428 1.478508 -2.887736
H  5.013126 -1.670221 -1.027455
