program: Gaussian 09
title: 000279816
version: EM64L-G09RevD.01
frameworkgroup: C1[X(C14H12O2S)]
method: RPBEPBE
basis: SDD
operation: Freq
keyword: #p
keyword: freq=noraman
keyword: PBEPBE/SDD
title: #p freq=noraman PBEPBE/SDD
converged: NO NO NO NO
title: Mulliken charges:
elementType: S O O C C C C C C C C C C C C C C H H H H H H H H H H H H
charge: 0.941193 -0.554867 -0.554868 -0.858062 -0.858061 0.360654 0.360652 0.233182 0.233181 -0.373999 -0.373999 -0.390356 -0.390356 -0.232901 -0.232901 -0.236069 -0.236069 0.303479 0.299883 0.303479 0.299883 0.248444 0.248444 0.255587 0.255586 0.238170 0.238170 0.236262 0.236262
chargesum: 0.00000
title: Mulliken charges with hydrogens summed into heavy atoms:
elementType: S O O C C C C C C C C C C C C C C
charge: 0.941193 -0.554867 -0.554868 -0.254700 -0.254700 0.360654 0.360652 0.233182 0.233181 -0.125555 -0.125556 -0.134769 -0.134769 0.005268 0.005268 0.000192 0.000192
polarizability: 2.43121893e+02 -1.30926598e-04 2.09754264e+02 -4.04737876e+00 4.53023985e-05 1.10080734e+02
1716.lowfreq: -3.9613 0.0004 0.0007 0.0010 7.3651 7.7144 61.1948 77.4455 84.2493
frequency: 61.1429 77.4272 84.2486 118.8428 150.3231 158.9223 202.3102 214.3565 276.8567 283.3525 292.9570 311.2334 352.1031 400.9688 408.9987 418.0674 459.4735 505.9220 520.9232 552.9450 564.4134 596.3347 607.7000 616.5628 700.0720 742.2871 768.9419 771.9855 778.6304 796.3851 818.5341 831.3955 850.2034 881.9375 888.2645 900.6595 933.2296 961.9505 963.6801 994.1158 996.4898 996.7522 1040.2659 1050.4133 1074.1039 1089.3446 1127.1578 1141.7475 1177.9507 1178.9550 1190.0413 1194.0505 1218.8889 1226.9900 1274.4085 1293.8784 1294.9625 1370.5583 1375.2727 1429.5287 1429.7677 1443.3974 1444.4085 1471.5533 1489.1613 1563.8647 1575.6656 1606.4075 1607.0227 3064.1676 3064.4960 3130.2990 3131.5260 3137.8594 3138.9193 3150.4666 3151.2613 3153.2509 3153.3259 3168.7809 3169.2572
redmass: 7.2579 5.6380 4.4176 4.3028 5.2377 7.4334 7.5581 9.9874 4.8794 3.3475 4.3611 5.2033 4.9622 3.9900 2.7953 3.7583 3.7516 4.1263 3.9718 6.1894 3.3680 4.8586 4.8294 6.8292 5.1295 2.7645 2.8235 1.4996 1.5182 9.5018 4.4819 4.0449 2.0095 1.4322 1.5221 1.7659 3.7266 1.4666 1.3972 4.5533 1.3403 1.5032 2.3154 2.0580 1.5836 1.2877 1.3085 1.3250 1.0689 1.0583 1.1767 1.1439 2.2994 2.6710 1.8786 2.0614 1.4344 6.3284 8.9458 1.5702 1.7018 1.4647 1.4173 2.4973 3.0435 6.0739 6.7047 6.2062 6.2735 1.0570 1.0571 1.0861 1.0857 1.0893 1.0896 1.0953 1.0962 1.1099 1.1102 1.1009 1.1009
irintensity: 3.8263 0.8312 0.5629 0.0039 3.2984 0.7199 4.0892 8.7249 1.2371 2.6964 0.1868 26.7289 11.1672 4.5536 4.9689 6.7371 31.4468 3.0572 7.4618 2.7276 0.1604 0.2491 2.8835 2.7778 0.0097 31.5320 12.3935 87.0183 19.1535 93.7792 0.0640 0.9497 9.0911 4.7989 7.1792 8.9995 66.4880 9.8320 0.5393 3.1248 0.0293 0.1928 0.3853 5.4939 14.4215 1.4393 0.6054 5.5844 0.0131 0.3621 1.0726 0.2630 6.4413 6.6674 0.2029 0.4472 0.1942 0.0496 1.4899 6.5609 3.5765 26.6837 7.9351 21.8756 1.7644 0.8472 0.7407 1.7861 0.7600 2.9823 2.2933 1.9598 0.2905 4.6160 0.9916 10.5243 17.5494 2.3977 0.8340 41.8334 9.0573
temp: 298.150 k
press: 1.00000 atm
elementType: 16 8 8 6 6 6 6 6 6 6 6 6 6 6 6 6 6 1 1 1 1 1 1 1 1 1 1 1 1
symmnumber: 1
zpe: 579024.1 jmol-1
zpe.correction: 0.220539 hartree
zpe.thermalcorrener: 0.234833 hartree
zpe.thermalcorrenthalpy: 0.235778 hartree
zpe.thermalcorrgfe: 0.179678 hartree
zpe.sumelectzpe: -1087.865007 hartree
zpe.sumelectthermal: -1087.850713 hartree
zpe.sumelectthermalent: -1087.849768 hartree
zpe.sumelectthermalfe: -1087.905868 hartree
dipole: 0.0000 -6.9823 0.0000
dipole: 6.9823
quadrupole: -92.4090 -122.6394 -106.1487
quadrupole: -0.0001 5.0792 0.0000
quadrupole: 14.6567 -15.5737 0.9170 -0.0001 5.0792 0.0000
hfenergy: -1088.0855461 hartree
pointgroup: C01 [X(C14H12O2S1)]
dipole: 0.0001421 2.7470347 -0.0000112 debye
polarizability: 243.0743843|-0.001738|209.7542636|4.7644147|-0.0005114|110.1282425 unknown
InChI: InChI=1S/C14H12O2S/c15-17(16)9-11-5-1-3-7-13(11)14-8-4-2-6-12(14)10-17/h1-8H,9-10H2
charge 0 multiplicity 1
29 atoms
S  -0.000125 -2.549766 -0.000009
O  -1.208699 -3.364773 -0.744805
O  1.208366 -3.364887 0.744795
C  0.784436 -1.240063 -1.302498
C  -0.784555 -1.239975 1.30247
C  1.480155 -0.13486 -0.59253
C  -1.480156 -0.134701 0.592496
C  0.746401 0.955619 -0.014894
C  -0.746285 0.955699 0.014857
C  2.900056 -0.131101 -0.525896
C  -2.900057 -0.13079 0.52586
C  1.46516 2.047191 0.537548
C  -1.464928 2.047345 -0.53759
C  3.596672 0.94887 0.050816
C  -3.596557 0.949252 -0.050857
C  2.875611 2.0500 0.571029
C  -2.875378 2.050304 -0.571073
H  -0.12063 -0.956389 -1.858686
H  1.441088 -1.893945 -1.894737
H  0.120538 -0.956393 1.858661
H  -1.441278 -1.893784 1.89471
H  3.452517 -0.980809 -0.942357
H  -3.452609 -0.980437 0.942324
H  0.906356 2.881989 0.975015
H  -0.906034 2.882082 -0.97506
H  4.690787 0.936708 0.09273
H  -4.690673 0.937207 -0.092773
H  3.409899 2.896424 1.015758
H  -3.409576 2.896783 -1.015806
