program: Gaussian 09
title: 000279763
version: EM64L-G09RevD.01
frameworkgroup: C1[X(C7H14O2)]
method: RPBEPBE
basis: SDD
operation: Freq
keyword: #pfreq=noraman
keyword: PBEPBE/SDD
title: #p freq=noraman PBEPBE/SDD
converged: YES YES NO NO
title: Mulliken charges:
elementType: O O C C C C C C C H H H H H H H H H H H H H H
charge: -0.455242 -0.437639 0.348494 -0.493065 -0.538483 -0.121108 -0.117385 -0.737514 -0.742251 0.213421 0.215156 0.214647 0.237865 0.216688 0.258851 0.201135 0.218199 0.217923 0.212033 0.215050 0.213032 0.334998 0.325195
chargesum: 0.00000
title: Mulliken charges with hydrogens summed into heavy atoms:
elementType: O O C C C C C C C
charge: -0.120244 -0.112445 0.348494 -0.064488 -0.085971 0.095580 0.141467 -0.100257 -0.102135
polarizability: 8.54368464e+01 1.78984011e+00 7.88873673e+01 8.40406083e-01 1.50237355e-01 7.30374476e+01
1716.lowfreq: -19.7987 -8.3334 -0.0008 -0.0008 0.0010 21.7037 42.9858 121.6157 201.9467
frequency: 41.8875 121.5039 201.9049 222.2524 238.9900 244.5803 274.4066 286.9797 308.4181 341.1763 360.7194 396.8444 440.5782 490.7460 546.5041 629.5687 753.0560 808.7229 885.0918 899.1751 922.8693 932.3531 935.0633 969.3213 990.0161 1013.9489 1024.0001 1072.4913 1104.8744 1134.9202 1170.1362 1176.3582 1218.0316 1248.6286 1259.8926 1260.5632 1286.7028 1303.2761 1312.0898 1367.7602 1376.5966 1383.8269 1394.7959 1449.7801 1457.7351 1464.6520 1475.1255 1480.4020 1486.6563 2962.6048 2966.3379 2968.8506 2984.1458 2993.0888 3048.8644 3052.5802 3055.2997 3060.2621 3066.8628 3068.1716 3089.8852 3553.2409 3565.1005
redmass: 3.3367 3.0316 1.0460 1.5077 1.1023 1.4559 1.5547 2.1368 2.7976 2.5139 2.5494 2.0780 2.3870 3.4177 3.0237 3.6373 3.5984 2.5992 2.1176 1.8974 1.9332 1.5834 2.1100 1.8362 2.2654 2.2874 1.5481 2.5814 1.4121 1.4111 1.4207 1.4185 1.8609 1.7923 1.4438 1.4742 2.0025 1.5871 1.5399 1.2510 1.2461 1.2718 1.2336 1.0793 1.0714 1.0495 1.0772 1.0597 1.0553 1.0440 1.0404 1.0711 1.0592 1.0615 1.1038 1.0995 1.1008 1.0993 1.0991 1.0990 1.0877 1.0661 1.0663
irintensity: 1.6334 2.5622 0.5312 3.0321 67.7251 44.5734 93.5075 2.8166 49.0329 13.0339 4.8895 2.7811 10.9817 2.8892 1.4408 10.5818 0.2905 15.3959 2.2307 1.4879 41.8696 0.6402 31.6775 17.9744 29.4081 47.4625 2.5813 7.6394 51.0736 16.2028 32.0894 12.4738 4.9079 10.1057 7.4391 10.6952 22.2231 3.2119 16.4694 4.2562 29.9533 14.7234 5.3278 10.9553 1.0845 1.4969 14.9852 7.4750 14.3707 11.7671 33.9336 60.3908 37.0242 17.7500 18.4037 25.9591 36.3354 15.3886 60.2679 62.4913 17.9124 2.8325 4.4845
temp: 298.150 k
press: 1.00000 atm
elementType: 8 8 6 6 6 6 6 6 6 1 1 1 1 1 1 1 1 1 1 1 1 1 1
symmnumber: 1
zpe: 523971.9 jmol-1
zpe.correction: 0.199570 hartree
zpe.thermalcorrener: 0.210041 hartree
zpe.thermalcorrenthalpy: 0.210985 hartree
zpe.thermalcorrgfe: 0.164511 hartree
zpe.sumelectzpe: -424.825037 hartree
zpe.sumelectthermal: -424.814566 hartree
zpe.sumelectthermalent: -424.813622 hartree
zpe.sumelectthermalfe: -424.860097 hartree
dipole: 3.0885 -1.3452 1.7566
dipole: 3.7993
quadrupole: -64.4851 -55.3423 -53.6077
quadrupole: 5.4775 -3.2447 -1.2105
quadrupole: -6.6734 2.4694 4.2040 5.4775 -3.2447 -1.2105
hfenergy: -425.0246077 hartree
pointgroup: C01 [X(C7H14O2)]
dipole: -1.2296787 0.5815789 0.6196073 debye
dipolederiv: -0.848961 -0.1944695 -0.0655199 -0.1968805 -0.465545 0.2182737 0.0310845 0.2438685 -0.2984711 -0.3599803 0.0643369 -0.2177426 0.1305388 -0.7527398 0.0348245 -0.2996426 0.1110628 -0.4425934 0.1457542 -0.0084742 0.0165089 0.0360736 0.1198413 -0.0357562 -0.0134647 -0.0299022 0.1358782 -0.2405093 -0.0595205 -0.0443846 -0.0036182 -0.0291067 0.0620043 -0.0261843 0.0096253 0.0815774 -0.1660748 0.0503995 -0.0696351 -0.032537 0.0057435 -0.0391406 -0.0364093 0.0458912 0.0003801 0.6082131 0.1887735 -0.0159066 0.1770039 0.2898771 -0.1232567 -0.054809 -0.1767538 0.2516594 0.3250112 -0.0184989 0.0854655 -0.0769503 0.5258436 -0.1179418 0.1280855 -0.2136242 0.341583 0.0637705 -0.0008118 0.0040963 0.0075164 0.0194354 0.0487349 0.0341514 0.0503716 -0.0677744 -0.0305607 0.0223332 -0.0376446 0.0171616 0.0545716 0.0297467 -0.04906 0.0262763 0.0304775 0.028662 0.0489981 0.0408493 0.0363843 -0.034274 -0.1019514 0.0496445 -0.1533177 -0.0689666 0.0527 -0.0043718 0.0041455 -0.002014 -0.0036818 0.0795652 -0.0089927 0.1332183 -0.072998 0.035781 0.0178422 -0.021821 0.0268889 0.0620782 0.1011249 -0.0160541 0.0491608 -0.1422709 0.0321308 -0.0636823 -0.0110472 -0.0565148 -0.1474592 -0.0319093 0.0100647 0.0124044 0.0827201 -0.0217944 -0.019932 -0.021193 -0.0020571 -0.0160127 0.067345 -0.0201295 0.0738825 -0.179369 -0.023008 0.0140812 0.0666306 0.0083532 0.0536641 0.0175083 0.0703434 0.0285317 -0.0250792 -0.1258768 0.0764112 -0.1370513 0.0609575 0.0520714 0.0456048 -0.1197842 0.0427373 0.0131566 -0.0062704 0.0657251 0.1105606 0.1042844 -0.0058085 -0.1127481 0.0791163 -0.0564247 -0.0145341 0.0121283 -0.1177985 0.0048437 -0.1302082 -0.1022982 0.0056463 -0.0299855 -0.0471784 0.0664814 -0.0120766 0.078873 0.0417434 0.1221882 -0.0171651 -0.0803322 0.1013196 -0.113377 -0.0071313 0.0609831 -0.0322827 0.0648271 -0.0012473 0.0356977 0.1049262 0.0059378 0.1078443 -0.1171387 -0.0365568 -0.089349 -0.0377586 -0.1553538 -0.081494 -0.0458518 -0.0418618 -0.0187436 0.0814072 0.3689673 0.0272186 0.0669951 -0.0346403 0.1152118 -0.1472132 0.0435548 -0.1689187 0.1778465 0.1375677 -0.0458012 0.1730387 -0.0353293 0.3215492 0.0207965 0.1630752 0.0433653 0.1731595 unknown
polarizability: 85.3379266|1.8402229|78.8445078|-1.0694774|-0.9292942|73.1792268 unknown
InChI: InChI=1S/C7H14O2/c1-7(2)3-5(8)6(9)4-7/h5-6,8-9H,3-4H2,1-2H3
charge 0 multiplicity 1
23 atoms
O  2.180516 1.508588 -0.23703
O  1.603429 -1.824804 0.330537
C  -1.252637 0.066966 0.008919
C  -0.291818 1.276155 0.226168
C  -0.380618 -0.846941 -0.911796
C  1.128289 0.663558 0.355693
C  1.09145 -0.676956 -0.442836
C  -1.566178 -0.630673 1.361252
C  -2.576032 0.484835 -0.668735
H  -0.579215 1.900547 1.093391
H  -0.301698 1.91651 -0.678259
H  -0.475711 -0.492005 -1.95613
H  -0.691642 -1.907767 -0.898718
H  1.378255 0.442157 1.414671
H  1.798971 -0.603421 -1.282698
H  -0.647068 -0.886053 1.923443
H  -2.168913 0.030533 2.011958
H  -2.141521 -1.561804 1.200889
H  -3.14699 1.187245 -0.03212
H  -2.385041 0.983731 -1.637393
H  -3.220642 -0.394031 -0.860655
H  2.285493 2.327614 0.309623
H  0.92862 -2.080579 1.009523
