program: Gaussian 09
title: 000279786
version: EM64L-G09RevD.01
frameworkgroup: C1[X(C13H11BrO4S2)]
method: RPBEPBE
basis: SDD
operation: Freq
keyword: #p
keyword: freq=noraman
keyword: PBEPBE/SDD
title: #p freq=noraman PBEPBE/SDD
converged: YES YES NO NO
title: Mulliken charges:
elementType: Br S S O O O O C C C C C C C C C C C C C H H H H H H H H H H H
charge: 0.189101 0.925667 0.939439 -0.536465 -0.513135 -0.532878 -0.505926 -0.710491 -0.052063 -0.077733 -0.219515 -0.221881 -0.257108 -0.266607 -0.215719 -0.214862 -0.206812 -0.204516 -0.210446 -0.211681 0.375351 0.330905 0.334295 0.297947 0.299479 0.247325 0.247988 0.244816 0.245425 0.239714 0.240384
chargesum: 0.00000
title: Mulliken charges with hydrogens summed into heavy atoms:
elementType: Br S S O O O O C C C C C C C C C C C C C
charge: 0.189101 0.925667 0.939439 -0.536465 -0.513135 -0.532878 -0.505926 -0.335140 -0.052063 -0.077733 0.111390 0.112415 0.040839 0.032872 0.031606 0.033126 0.038004 0.040909 0.029268 0.028702
polarizability: 3.17593662e+02 9.41569395e+00 1.91301823e+02 8.61557634e+00 3.27031505e+00 1.69275937e+02
1716.lowfreq: -6.9422 -5.4854 0.0015 0.0020 0.0023 5.0339 20.3417 25.5618 35.5402
frequency: 20.1980 25.5106 35.5219 40.1384 52.8859 75.5627 111.6669 115.0437 128.3838 138.9059 152.9049 167.5751 174.1530 193.6489 213.3143 246.2467 248.6879 323.3038 325.4272 344.3981 380.9703 387.3787 403.6362 404.4964 429.5052 460.1285 489.7203 515.6288 545.8090 600.7414 600.8105 648.8778 652.7724 670.3790 684.1136 686.5463 762.6141 763.0444 796.6247 806.4951 848.8699 850.5182 921.2689 935.7171 939.3208 944.7333 971.0564 971.7035 987.1076 987.5032 1005.1693 1005.5051 1007.4324 1007.7577 1040.4903 1041.8224 1047.5431 1080.1609 1082.7097 1109.5306 1173.5792 1174.3647 1185.0553 1188.0536 1311.1723 1314.4294 1382.1077 1383.3653 1437.1242 1438.1011 1452.6826 1454.0714 1572.2251 1572.8087 1599.6637 1600.5425 3071.6729 3139.1459 3139.6318 3147.3663 3147.7910 3154.9405 3155.2305 3165.1451 3165.3914 3175.2882 3175.6441
redmass: 5.7301 5.2874 4.7447 8.4855 6.4296 7.2300 12.5106 16.6912 10.7332 8.0434 8.3803 9.8790 6.9365 7.9679 10.2797 9.1965 9.0329 7.4055 7.4264 8.5133 10.6263 10.6645 2.8884 2.8490 6.8086 5.9486 4.6584 5.4784 9.0743 6.4895 6.4875 7.1411 7.2800 7.2882 2.4503 2.4422 1.4082 1.4103 13.5423 15.2353 1.2535 1.2466 11.4625 2.4246 1.4403 2.4150 4.8235 5.2767 1.4353 1.4603 4.6497 4.3280 1.3476 1.3886 1.5062 2.0032 1.4532 1.5746 1.5885 1.0927 1.0649 1.0615 1.1216 1.1254 1.2850 1.2775 8.1912 8.1148 2.2648 2.2740 1.9570 1.9404 5.6495 5.6321 6.8604 6.8541 1.0871 1.0862 1.0863 1.0899 1.0899 1.0926 1.0928 1.0966 1.0966 1.1015 1.1016
irintensity: 0.8410 2.4153 0.5880 0.1241 2.8391 0.1108 1.4404 1.3501 2.1954 2.0754 3.9171 0.5750 10.4083 2.4362 4.1530 19.3145 0.8719 7.7925 0.6983 55.7868 34.6105 4.3127 0.1006 2.3699 28.8071 29.7528 49.6190 90.1598 82.3817 1.0783 0.8633 10.0561 10.6567 23.4832 36.5264 34.8219 71.8111 77.6294 82.5855 46.3173 2.7719 0.7441 66.7294 56.0817 4.2882 18.6877 1.8755 4.0039 1.6118 0.0630 0.3897 0.9999 0.0088 0.0106 6.8502 21.8583 37.0917 4.9824 5.1272 12.7684 2.6370 1.2166 21.2297 8.4827 3.0954 3.4679 7.8525 8.8737 18.7854 17.5918 32.7490 15.3354 5.5349 2.2578 1.5669 1.2425 1.9868 5.6650 6.2523 18.2647 28.1885 2.6286 2.5913 2.2878 1.7131 61.6525 17.6244
temp: 298.150 k
press: 1.00000 atm
elementType: 35 16 16 8 8 8 8 6 6 6 6 6 6 6 6 6 6 6 6 6 1 1 1 1 1 1 1 1 1 1 1
symmnumber: 1
zpe: 547209.5 jmol-1
zpe.correction: 0.208421 hartree
zpe.thermalcorrener: 0.228892 hartree
zpe.thermalcorrenthalpy: 0.229836 hartree
zpe.thermalcorrgfe: 0.156072 hartree
zpe.sumelectzpe: -1610.662836 hartree
zpe.sumelectthermal: -1610.642366 hartree
zpe.sumelectthermalent: -1610.641421 hartree
zpe.sumelectthermalfe: -1610.715185 hartree
dipole: -0.2733 0.0170 -0.2502
dipole: 0.3709
quadrupole: -92.1494 -145.0334 -155.2409
quadrupole: 2.7731 13.0957 -7.5429
quadrupole: 38.6585 -14.2255 -24.4330 2.7731 13.0957 -7.5429
hfenergy: -1610.8712574 hartree
pointgroup: C01 [X(C13H11Br1O4S2)]
dipole: 0.1158122 0.0808678 -0.0366637 debye
polarizability: 314.4864885|6.5460531|176.2340529|22.3714053|11.809627|187.4508797 unknown
InChI: InChI=1S/C13H11BrO4S2/c14-13(19(15,16)11-7-3-1-4-8-11)20(17,18)12-9-5-2-6-10-12/h1-10,13H
charge 0 multiplicity 1
31 atoms
Br -0.829869 -0.535479 -3.092927
S  -1.118317 1.627766 -0.625287
S  0.992032 -1.010913 -0.391233
O  -0.334636 1.953571 0.767431
O  -1.387421 2.821068 -1.709107
O  0.056469 -1.236699 0.922017
O  1.379893 -2.275602 -1.344313
C  0.071789 0.348088 -1.625124
C  -2.773976 0.770407 -0.29618
C  2.615055 -0.145606 0.085354
C  -2.858594 -0.187795 0.726741
C  2.579015 0.893801 1.028932
C  -3.855119 1.204202 -1.081523
C  3.784978 -0.652066 -0.505029
C  -4.133716 -0.751748 0.967144
C  3.819818 1.466752 1.39611
C  -5.117527 0.625242 -0.817525
C  5.010554 -0.06154 -0.118704
C  -5.252997 -0.347968 0.200971
C  5.02506 0.991807 0.826387
H  0.881107 1.009104 -1.985136
H  -1.973225 -0.497704 1.291249
H  1.629849 1.253019 1.439941
H  -3.710764 1.970411 -1.850166
H  3.734275 -1.481517 -1.217987
H  -4.244841 -1.508116 1.750629
H  3.837453 2.284507 2.123641
H  -5.987443 0.935867 -1.405058
H  5.946656 -0.428482 -0.551814
H  -6.234501 -0.792119 0.398983
H  5.979043 1.442242 1.120979
