program: Gaussian 09
title: 000279697
version: EM64L-G09RevD.01
frameworkgroup: C1[X(C13H21N3O)]
method: RPBEPBE
basis: SDD
operation: Freq
keyword: #p
keyword: freq=noraman
keyword: PBEPBE/SDD
title: #p freq=noraman PBEPBE/SDD
converged: YES YES NO NO
title: Mulliken charges:
elementType: O N N N C C C C C C C C C C C C C H H H H H H H H H H H H H H H H H H H H H
charge: -0.255489 -0.003592 -0.407823 -0.651934 0.342443 0.143874 -0.579698 -0.551771 -0.390872 -0.402073 -0.388828 -0.526459 -0.430998 -0.415479 -0.529937 0.015652 0.289214 0.237963 0.210140 0.209969 0.273516 0.197216 0.198078 0.205180 0.194414 0.203508 0.188789 0.228596 0.206110 0.200630 0.210036 0.207567 0.209152 0.233242 0.200006 0.290171 0.341262 0.298223
chargesum: 0.00000
title: Mulliken charges with hydrogens summed into heavy atoms:
elementType: O N N N C C C C C C C C C C C C C
charge: -0.255489 -0.003592 -0.117652 -0.012449 0.342443 0.143874 -0.131594 -0.068286 0.004423 -0.002479 0.003468 -0.091753 -0.020332 0.001240 -0.096689 0.015652 0.289214
polarizability: 2.28932250e+02 -5.98156066e-01 1.83705221e+02 8.14910721e+00 5.19594313e+00 1.13984504e+02
1716.lowfreq: -10.5403 -8.0440 -6.5117 -0.0010 -0.0008 -0.0008 28.3003 42.1222 47.8491
frequency: 28.1745 41.8547 47.8206 63.8131 89.9034 97.0437 134.7872 154.4941 194.6640 222.0621 256.0964 265.8132 284.6573 305.4260 321.7392 347.0986 401.6824 416.4831 431.6630 449.1922 467.6256 470.8048 492.3224 518.2135 533.2521 558.2819 576.2174 591.7273 667.0991 708.1343 718.4577 773.1676 791.3708 829.8084 847.0115 853.5593 881.7115 900.5139 904.6066 917.7030 919.6679 947.4124 982.8176 991.1242 1039.7105 1045.4232 1068.7016 1076.0388 1082.5358 1093.1540 1095.0173 1103.0242 1121.5099 1126.4743 1147.1811 1151.5072 1225.4819 1239.8435 1252.0373 1254.9621 1259.7501 1263.4599 1288.4598 1305.9818 1307.7783 1315.0216 1323.0709 1332.0137 1338.2081 1339.8810 1342.1713 1348.0161 1352.0333 1447.5794 1455.9484 1457.9624 1460.9899 1462.5897 1471.0146 1473.6194 1474.6906 1475.2790 1488.6997 1531.3374 1599.7089 1610.5317 1676.4667 2918.6617 2941.4887 2961.0613 2961.5902 2963.6871 2965.1690 2969.1220 2969.7566 2975.5457 2989.3426 3011.8206 3023.5956 3028.5946 3039.1557 3043.8615 3049.6907 3065.8158 3098.2971 3417.4088 3536.5774 3694.8511
redmass: 3.9870 3.7854 3.2954 4.1183 2.9453 3.2093 2.6452 3.8162 2.6350 3.0719 4.0159 1.7416 2.0520 1.8376 2.0366 2.5946 2.6172 2.7757 2.5843 3.0971 1.8403 2.0523 1.2938 2.2842 2.1868 2.9154 2.5496 4.8945 2.7374 8.1577 3.9668 1.5132 3.3231 1.5065 1.5912 2.3664 2.5414 2.4423 1.5238 1.5964 2.2477 2.5609 2.4704 2.6299 2.5138 1.9951 1.7441 1.3606 1.5864 2.3508 1.6313 1.8882 1.6208 2.0876 1.4765 1.9078 1.4870 1.6448 1.2902 1.3419 1.3258 1.3991 2.3418 1.5570 1.5503 1.6245 1.4325 1.4000 1.4169 1.5623 1.5861 1.5680 1.5369 1.1639 1.0892 1.0846 1.0905 1.0863 1.0864 1.0871 1.1244 1.1119 1.6025 8.0276 1.2897 6.3196 5.1487 1.0595 1.0696 1.0704 1.0602 1.0607 1.0936 1.0612 1.0640 1.0664 1.0653 1.0987 1.0971 1.1005 1.1033 1.0985 1.1043 1.0896 1.0885 1.0745 1.0458 1.1034
irintensity: 6.5320 5.3441 7.3443 3.8722 1.5204 0.8129 2.3398 1.6531 1.2118 1.4504 1.9327 7.1474 10.6969 1.4367 18.4755 4.8484 14.1071 3.1773 36.4966 7.5230 175.2339 12.1081 78.9309 32.6599 17.1842 12.2595 16.0344 1.4250 5.9110 23.7032 5.0418 0.2232 3.7651 5.5985 11.2199 4.3220 7.7231 4.0231 3.2715 1.9289 5.0236 7.2634 7.5133 6.2948 31.6551 1.7598 5.1004 0.7702 20.1545 85.5735 3.6765 32.0607 12.2418 0.4167 3.4621 1.5086 14.9538 5.2458 1.2326 11.1990 13.2012 7.2421 375.4526 3.5237 40.5966 10.1705 8.1407 1.0529 0.4697 3.1336 0.8625 2.1014 4.4334 110.9255 8.2800 4.1560 5.6289 13.4270 15.0106 18.0551 14.5275 9.3064 278.8732 21.7316 173.3514 39.0673 255.6210 24.6764 22.5456 13.1157 28.6259 38.8649 11.0733 42.2775 46.9859 29.4450 51.5219 26.8154 87.5441 45.5083 90.9875 74.7462 60.1318 39.8041 6.9054 17.6391 49.4481 40.0273
temp: 298.150 k
press: 1.00000 atm
elementType: 8 7 7 7 6 6 6 6 6 6 6 6 6 6 6 6 6 1 1 1 1 1 1 1 1 1 1 1 1 1 1 1 1 1 1 1 1 1
symmnumber: 1
zpe: 857405.7 jmol-1
zpe.correction: 0.326569 hartree
zpe.thermalcorrener: 0.343703 hartree
zpe.thermalcorrenthalpy: 0.344647 hartree
zpe.thermalcorrgfe: 0.280870 hartree
zpe.sumelectzpe: -746.122828 hartree
zpe.sumelectthermal: -746.105694 hartree
zpe.sumelectthermalent: -746.104750 hartree
zpe.sumelectthermalfe: -746.168526 hartree
dipole: 1.7275 4.8081 2.2421
dipole: 5.5793
quadrupole: -76.9431 -106.5163 -104.8647
quadrupole: 8.8851 7.4393 -1.8840
quadrupole: 19.1650 -10.4083 -8.7567 8.8851 7.4393 -1.8840
hfenergy: -746.449397 hartree
pointgroup: C01 [X(C13H21N3O1)]
dipole: -0.5987747 -1.9136354 0.8932058 debye
polarizability: 228.7131947|0.9936435|183.6995206|-9.2926313|-5.6525504|114.2092598 unknown
InChI: InChI=1S/C13H21N3O/c14-13(17)16-15-12-9-5-4-8-11(12)10-6-2-1-3-7-10/h16H,1-9,14H2
charge 0 multiplicity 1
38 atoms
O  -3.134588 2.339996 -0.544767
N  -1.411118 0.133405 -0.206641
N  -2.740497 0.122788 0.195721
N  -4.899757 1.021677 0.226235
C  1.544041 0.282867 -0.330478
C  0.786494 -0.871595 -0.262904
C  2.987001 0.266244 -0.832408
C  1.075832 1.676681 0.064805
C  3.976098 0.956478 0.148653
C  2.07014 2.373191 1.036672
C  3.512435 2.390296 0.486511
C  1.413438 -2.23698 -0.620191
C  0.493866 -3.448775 -0.344721
C  -0.194984 -3.267147 1.021367
C  -1.201576 -2.103127 0.905484
C  -0.646855 -0.89901 0.13485
C  -3.553244 1.246399 -0.087095
H  3.339951 -0.752763 -1.060422
H  3.014404 0.830771 -1.790862
H  0.98638 2.293793 -0.85492
H  0.063218 1.654796 0.491505
H  4.039985 0.360828 1.082189
H  4.989737 0.969348 -0.298045
H  1.718266 3.404555 1.23254
H  2.059313 1.838913 2.009147
H  4.202442 2.85715 1.216457
H  3.546938 3.011101 -0.433083
H  1.712305 -2.239731 -1.687528
H  2.345411 -2.377548 -0.036792
H  -0.282003 -3.535269 -1.132381
H  1.089932 -4.379932 -0.375812
H  0.568899 -3.039265 1.790678
H  -0.719631 -4.1859 1.343865
H  -1.531364 -1.774251 1.915666
H  -2.109169 -2.482297 0.38309
H  -3.137154 -0.659436 0.731641
H  -5.530919 1.807507 0.092521
H  -5.291163 0.106144 0.43825
