program: Gaussian 09
title: 000025478
version: EM64L-G09RevD.01
frameworkgroup: C1[X(C10H16O2)]
method: RPBEPBE
basis: SDD
operation: Freq
keyword: #pfreq=noraman
keyword: PBEPBE/SDD
title: #p freq=noraman PBEPBE/SDD
converged: NO YES NO NO
title: Mulliken charges:
elementType: O O C C C C C C C C C C H H H H H H H H H H H H H H H H
charge: -0.446656 -0.180054 0.324096 0.140676 -0.192521 -0.152214 -0.525176 -0.556264 0.091833 -0.763959 -0.776081 -0.796099 0.249334 0.233352 0.241974 0.244079 0.259681 0.250140 0.239440 0.216866 0.216656 0.217758 0.219559 0.232498 0.237212 0.213872 0.219701 0.340297
chargesum: 0.00000
title: Mulliken charges with hydrogens summed into heavy atoms:
elementType: O O C C C C C C C C C C
charge: -0.106359 -0.180054 0.324096 0.140676 0.056813 0.081138 -0.039123 -0.046443 0.091833 -0.090997 -0.106265 -0.125315
polarizability: 1.08718176e+02 4.49796465e+00 1.03054696e+02 5.69196424e-01 2.09997427e+00 1.02736248e+02
1716.lowfreq: -24.0247 -16.7090 -0.0005 -0.0004 0.0006 8.3323 88.9983 112.5418 136.8443
frequency: 88.8030 112.4704 136.6180 152.0815 203.6585 206.3784 222.3187 237.0827 278.3960 286.7531 315.3079 371.7549 402.3033 422.6728 446.9910 449.2427 518.4977 542.4720 548.9820 605.8522 639.3996 689.1228 774.3166 819.7598 849.8237 885.7347 908.6885 943.1484 948.1884 952.5320 972.5924 995.7518 1021.1308 1024.8372 1058.4651 1079.1677 1105.7899 1124.8924 1133.6397 1169.4362 1195.9022 1201.2731 1213.0844 1230.3274 1240.3750 1264.2709 1291.3677 1299.3912 1324.3475 1355.8038 1387.9401 1394.0962 1405.7943 1433.6598 1460.1478 1465.9808 1469.0942 1475.7719 1480.9777 1488.9537 1496.6673 1666.2719 2963.8971 2976.0667 2976.4370 2980.4481 3015.2903 3027.3255 3058.4423 3060.0011 3061.2362 3065.6852 3073.4495 3079.1306 3082.6078 3087.9657 3092.9634 3553.2172
redmass: 2.5227 4.9133 1.0703 1.2205 2.6366 1.1312 2.7361 2.5441 2.8925 1.9344 1.5613 2.6054 2.5961 2.5272 3.7869 2.5732 3.0416 4.4277 3.6477 3.1034 3.9633 3.0453 2.7104 2.2345 2.5385 2.2346 2.0681 1.8618 1.4120 2.5435 2.2269 1.4692 1.9734 1.8986 2.8969 1.2900 1.6248 1.8078 2.1600 1.6205 1.5576 2.3637 1.7009 1.6976 2.1097 2.1356 1.7562 1.4254 2.1013 1.5210 1.1986 1.2331 1.1889 1.0833 1.0488 1.0492 1.0640 1.0556 1.0560 1.0585 1.0595 11.9419 1.0853 1.0370 1.0370 1.0376 1.0611 1.0617 1.0988 1.0964 1.0915 1.0972 1.1015 1.0988 1.0985 1.0999 1.1010 1.0658
irintensity: 2.6459 5.4501 0.5500 0.4942 1.8351 0.0993 3.0618 2.3804 14.8943 30.7969 105.0951 1.4069 0.7297 3.8115 1.3137 6.7038 3.5872 4.4411 1.4744 2.1090 0.7433 0.4130 1.5620 1.9468 3.7353 13.7152 9.2220 7.0215 3.5821 16.3202 41.1535 8.0783 52.6443 5.0986 21.1798 4.3388 3.2652 0.3265 8.8391 14.6211 21.7394 4.8260 11.2694 34.3904 1.3820 9.3857 13.1740 2.8999 9.7244 6.9319 15.0472 18.1212 29.2384 18.6565 13.8373 5.0558 11.0867 14.7556 7.8264 4.3662 3.6141 184.2961 39.2669 31.6091 18.0243 45.2279 9.6037 27.1804 3.5114 7.4854 38.6617 63.5127 13.3386 16.7541 28.0846 47.4188 20.7732 4.8549
temp: 298.150 k
press: 1.00000 atm
elementType: 8 8 6 6 6 6 6 6 6 6 6 6 1 1 1 1 1 1 1 1 1 1 1 1 1 1 1 1
symmnumber: 1
zpe: 628283.0 jmol-1
zpe.correction: 0.239300 hartree
zpe.thermalcorrener: 0.251765 hartree
zpe.thermalcorrenthalpy: 0.252709 hartree
zpe.thermalcorrgfe: 0.202382 hartree
zpe.sumelectzpe: -540.152614 hartree
zpe.sumelectthermal: -540.140150 hartree
zpe.sumelectthermalent: -540.139206 hartree
zpe.sumelectthermalfe: -540.189533 hartree
dipole: -3.3050 -1.5969 0.8810
dipole: 3.7748
quadrupole: -77.8099 -80.1055 -67.9021
quadrupole: -2.3882 3.7018 0.3274
quadrupole: -2.5374 -4.8330 7.3704 -2.3882 3.7018 0.3274
hfenergy: -540.3919148 hartree
pointgroup: C01 [X(C10H16O2)]
dipole: -1.3259322 0.6260265 -0.235722 debye
polarizability: 109.0982242|-4.0428893|101.9225681|-1.429245|1.9154857|103.4883279 unknown
InChI: InChI=1S/C10H16O2/c1-9(2)6-4-7(11)10(9,3)8(12)5-6/h6-7,11H,4-5H2,1-3H3
charge 0 multiplicity 1
28 atoms
O  2.187135 1.328102 -0.198902
O  1.700953 -1.922307 -0.066541
C  -1.306145 -0.026551 -0.054893
C  0.131087 -0.093248 -0.727199
C  -0.731576 0.367076 1.363758
C  0.723145 1.322658 -0.343464
C  0.100403 1.644773 1.047321
C  0.28693 -0.772832 1.650788
C  0.8457 -1.061841 0.243946
C  -2.055689 -1.381036 -0.080903
C  -2.245726 1.03737 -0.670666
C  0.253612 -0.459256 -2.203144
H  -1.491428 0.50208 2.151165
H  0.426365 2.054249 -1.123644
H  -0.527027 2.551034 1.013963
H  0.906886 1.815608 1.779779
H  -0.176803 -1.684299 2.069116
H  1.103958 -0.47499 2.331517
H  -1.443331 -2.229688 0.269703
H  -2.959986 -1.329945 0.554549
H  -2.387585 -1.618876 -1.108585
H  -2.533304 0.749929 -1.699244
H  -3.176194 1.106262 -0.075455
H  -1.804939 2.046664 -0.716656
H  -0.190821 -1.448505 -2.411845
H  -0.243019 0.290776 -2.846227
H  1.315568 -0.528927 -2.506924
H  2.602233 0.96352 -1.022111
