program: Gaussian 09
title: 000279665
version: EM64L-G09RevD.01
frameworkgroup: C1[X(C16H22N2O)]
method: RPBEPBE
basis: SDD
operation: Freq
keyword: #p
keyword: freq=noraman
keyword: PBEPBE/SDD
title: #p freq=noraman PBEPBE/SDD
converged: YES YES NO NO
title: Mulliken charges:
elementType: O N N C C C C C C C C C C C C C C C C H H H H H H H H H H H H H H H H H H H H H H
charge: -0.291928 -0.129778 -0.060475 -0.084624 -0.235349 -0.489092 -0.409733 -0.386019 -0.446651 -0.422004 0.218897 0.518018 -0.488380 -0.636698 -0.456061 -0.396452 -0.230718 -0.251658 -0.246058 0.210785 0.241552 0.210957 0.245323 0.210570 0.233832 0.270200 0.209270 0.184115 0.235197 0.216216 0.206986 0.247499 0.191484 0.237896 0.228926 0.190886 0.237421 0.233633 0.226746 0.225617 0.229653
chargesum: 0.00000
title: Mulliken charges with hydrogens summed into heavy atoms:
elementType: O N N C C C C C C C C C C C C C C C C
charge: -0.291928 -0.129778 -0.060475 0.126161 0.006203 -0.032813 0.034669 0.093451 -0.027339 0.001198 0.218897 0.518018 -0.049397 0.021010 -0.218640 -0.162819 -0.003972 -0.026041 -0.016405
polarizability: 2.33904448e+02 -5.28149216e+00 1.62746490e+02 1.81051086e+00 9.04968778e+00 1.48555509e+02
1716.lowfreq: -12.9381 -7.2756 -0.0007 -0.0001 0.0005 8.0280 36.4910 47.1753 66.9029
frequency: 36.2621 47.1453 66.8605 78.7252 93.7081 122.2097 140.5731 182.6358 203.3462 216.5564 226.6718 260.2484 282.8261 327.4721 333.7237 344.6265 360.8470 404.9686 410.0040 442.9518 454.0282 463.6581 499.6478 539.1942 580.0665 597.0807 617.5008 644.9481 705.0550 707.0626 724.2460 769.2296 772.6775 814.7670 839.4653 850.0668 852.5675 875.7713 915.8981 916.5045 925.7613 958.4582 973.5592 979.5500 990.0528 994.1553 999.6255 1022.8418 1029.2325 1031.8790 1065.6093 1073.3155 1081.8251 1100.9860 1112.9252 1117.3087 1138.6428 1140.5105 1171.0952 1172.5412 1189.3597 1197.6719 1214.9687 1231.8082 1237.7110 1247.4164 1251.5818 1264.5148 1278.4161 1300.3645 1318.6580 1326.8296 1331.6494 1337.0422 1338.6749 1345.8015 1350.7743 1359.8244 1377.4956 1381.3379 1395.8189 1434.4868 1441.1038 1453.6981 1465.8910 1470.2770 1470.5881 1470.8585 1481.9022 1483.1432 1488.7072 1495.5384 1586.3039 1589.3004 1611.2641 2811.4880 2837.7348 2867.7029 2949.5754 2966.1438 2990.0921 2997.4499 3004.8308 3019.0188 3025.6224 3033.0749 3040.4009 3061.5283 3070.2887 3075.1587 3082.8069 3088.9384 3113.3559 3114.4990 3132.0222 3142.8045 3162.3411
redmass: 4.5008 3.8620 3.4528 3.1704 3.4512 3.9078 3.3288 2.0940 3.8704 1.7141 2.1555 2.7400 3.0614 3.2106 3.3307 2.9971 3.3682 2.8024 2.4741 3.0352 3.2935 2.6129 2.7808 2.7109 3.9897 4.7667 6.3843 3.2570 3.5832 1.7105 3.1990 2.1062 1.4150 3.1826 3.7401 1.8268 1.4796 3.3056 2.3807 1.5169 1.6759 2.3109 1.3961 2.3663 6.1071 1.3199 2.1213 2.3277 2.1142 2.3121 2.3332 2.1498 1.7159 1.8755 1.5646 1.5319 2.1627 3.5533 1.3088 1.0598 1.1119 1.7709 1.6202 1.6599 1.4305 2.0985 1.2613 1.7789 1.5099 1.3396 1.2599 1.3334 1.2522 1.3805 1.3067 1.3866 1.3689 1.3778 1.5273 4.1200 4.1011 1.1468 2.1306 1.0736 1.0829 1.0916 1.0557 1.1110 2.1748 1.0637 1.0850 1.0814 8.4533 5.9327 6.1457 1.0697 1.0696 1.0573 1.0827 1.0699 1.0592 1.0654 1.0665 1.0839 1.0739 1.0882 1.0990 1.0992 1.0968 1.0967 1.0977 1.0917 1.0878 1.0865 1.0903 1.0956 1.1013
irintensity: 2.2818 0.0205 1.9955 0.4282 0.8687 1.2203 1.0442 0.2156 2.4002 0.4490 0.7342 0.1952 2.8475 3.5828 2.1585 2.4877 6.1968 0.0224 0.8001 2.0757 2.7350 6.5864 6.2235 9.8926 9.9538 5.5505 0.3598 3.5252 22.0821 43.7265 9.8592 30.3142 1.0570 8.7161 7.2588 2.7551 1.7701 6.2118 7.6875 2.9907 6.2187 4.1862 0.3191 9.3920 0.0574 0.0286 7.3541 4.9314 10.9692 0.7852 17.5193 9.2827 7.1904 64.5082 13.9203 10.0250 36.8292 31.4518 3.0630 0.1508 0.1432 4.3477 4.1406 5.1155 13.0764 29.9092 1.2145 10.3104 10.7140 12.4676 3.7365 2.6473 1.2166 2.1664 2.4128 3.5754 15.3513 1.2306 0.9362 2.1801 136.7532 3.2392 8.5787 2.1939 2.6413 18.3335 32.9883 6.4896 14.1178 17.2212 17.7453 18.7670 357.3816 2.7574 3.8861 65.0448 69.6111 174.5057 25.6882 35.0641 22.5759 55.5169 29.6521 22.9186 31.6383 27.9424 11.0483 49.5778 49.7526 21.5753 11.3317 28.0774 6.9345 12.1009 8.7997 38.1763 25.6559
temp: 298.150 k
press: 1.00000 atm
elementType: 8 7 7 6 6 6 6 6 6 6 6 6 6 6 6 6 6 6 6 1 1 1 1 1 1 1 1 1 1 1 1 1 1 1 1 1 1 1 1 1 1
symmnumber: 1
zpe: 924769.2 jmol-1
zpe.correction: 0.352226 hartree
zpe.thermalcorrener: 0.369330 hartree
zpe.thermalcorrenthalpy: 0.370274 hartree
zpe.thermalcorrgfe: 0.307408 hartree
zpe.sumelectzpe: -806.181985 hartree
zpe.sumelectthermal: -806.164881 hartree
zpe.sumelectthermalent: -806.163937 hartree
zpe.sumelectthermalfe: -806.226804 hartree
dipole: 4.5708 0.2865 0.9786
dipole: 4.6831
quadrupole: -132.5822 -106.1040 -108.9602
quadrupole: -3.1362 -2.2576 2.5279
quadrupole: -16.7001 9.7781 6.9219 -3.1362 -2.2576 2.5279
hfenergy: -806.5342113 hartree
pointgroup: C01 [X(C16H22N2O1)]
dipole: -1.8000782 -0.0266062 0.3921616 debye
polarizability: 233.5733524|-7.329415|161.1427093|-1.4422057|-10.2505508|150.490385 unknown
InChI: InChI=1S/C16H22N2O/c1-17-11-14(13-7-3-2-4-8-13)15-9-5-6-10-18(15)16(19)12-17/h2-4,7-8,14-15H,5-6,9-12H2,1H3
charge 0 multiplicity 1
41 atoms
O  4.16896 0.157878 -0.017919
N  1.964099 0.867465 0.239462
N  1.632904 -2.153799 -0.197634
C  0.563784 0.632263 0.711329
C  -0.206962 -0.374473 -0.224646
C  -0.12059 2.012336 0.870369
C  -0.173735 2.82616 -0.447917
C  2.301577 2.190868 -0.350202
C  0.21116 -1.853017 0.0420
C  1.156128 2.689555 -1.251163
C  2.963599 -0.091165 0.307839
C  -1.727235 -0.295623 -0.091481
C  2.55429 -1.500064 0.763828
C  1.886976 -3.603453 -0.341863
C  -2.534413 -0.033895 -1.228157
C  -2.375574 -0.52737 1.152374
C  -3.943974 -0.000164 -1.131339
C  -3.783576 -0.491027 1.255426
C  -4.575036 -0.227622 0.113087
H  0.616075 0.169728 1.720142
H  0.075852 -0.137194 -1.267247
H  0.445071 2.580026 1.634329
H  -1.138062 1.870151 1.271758
H  -0.366158 3.886737 -0.199323
H  -1.027666 2.489905 -1.063687
H  3.240428 2.053169 -0.911806
H  2.51034 2.927155 0.452687
H  -0.08821 -2.116713 1.093305
H  -0.389201 -2.496317 -0.62787
H  1.034184 1.974968 -2.087145
H  1.446448 3.657493 -1.699749
H  3.496363 -2.068745 0.806776
H  2.126695 -1.479988 1.799761
H  2.940195 -3.767384 -0.628064
H  1.250035 -4.009325 -1.147922
H  1.682238 -4.191464 0.58785
H  -2.051467 0.137849 -2.1986
H  -1.778955 -0.732246 2.049909
H  -4.547371 0.202049 -2.023627
H  -4.263943 -0.669779 2.224292
H  -5.667574 -0.201729 0.191839
