program: Gaussian 09
title: 000279661
version: EM64L-G09RevD.01
frameworkgroup: C1[X(C12H27N3O)]
method: RPBEPBE
basis: SDD
operation: Freq
keyword: #p
keyword: freq=noraman
keyword: PBEPBE/SDD
title: #p freq=noraman PBEPBE/SDD
converged: NO YES NO NO
title: Mulliken charges:
elementType: O N N N C C C C C C C C C C C C H H H H H H H H H H H H H H H H H H H H H H H H H H H
charge: -0.434511 -0.042083 -0.084428 -0.084406 -0.072810 -0.072875 -0.174773 -0.448633 -0.448578 -0.427603 -0.427639 -0.627187 -0.616332 -0.630165 -0.630162 -0.616351 0.217205 0.217205 0.213849 0.254873 0.163654 0.163644 0.254838 0.224733 0.204378 0.204390 0.224737 0.185106 0.224637 0.224617 0.319025 0.187957 0.218707 0.226249 0.229911 0.219547 0.188451 0.188459 0.219521 0.229913 0.226257 0.218708 0.187964
chargesum: 0.00000
title: Mulliken charges with hydrogens summed into heavy atoms:
elementType: O N N N C C C C C C C C C C C C
charge: -0.115486 -0.042083 -0.084428 -0.084406 0.144395 0.144329 0.039076 -0.030106 -0.030095 0.001508 0.001488 0.007173 0.016582 0.007744 0.007731 0.016579
polarizability: 1.83756734e+02 1.21895159e-04 1.45877287e+02 1.83475066e-03 -7.84607315e-01 1.32542574e+02
1716.lowfreq: 0.0005 0.0007 0.0009 5.4125 10.6987 19.6213 36.6417 36.8847 44.1559
frequency: 36.3283 36.8800 44.0984 64.0014 83.6841 113.3598 114.5691 161.9804 165.8106 212.2446 224.4786 231.0259 235.0800 241.6170 243.6932 249.6549 279.9844 291.8132 305.3269 338.9563 342.6694 356.0348 369.6979 373.1631 396.1309 415.9808 445.2767 466.4413 490.6390 559.1650 567.6647 588.8605 800.8297 816.7283 840.9849 865.0089 876.6378 911.3345 915.9219 990.2324 1011.8394 1023.6506 1033.4874 1034.5302 1038.0639 1054.9455 1061.6653 1074.3609 1088.0625 1089.9595 1095.7852 1110.6699 1112.5194 1123.6347 1132.4683 1142.0905 1152.8035 1154.9665 1181.4382 1187.1883 1217.2286 1231.3475 1256.8670 1258.9755 1261.9457 1263.8801 1280.5595 1291.8660 1306.8549 1315.2224 1338.0650 1339.4825 1356.9410 1361.7585 1367.2713 1371.1115 1376.1790 1418.2520 1418.6106 1432.1945 1441.6698 1441.7570 1461.2478 1462.5484 1463.2539 1463.8623 1466.3202 1466.3543 1476.1277 1476.1784 1477.2790 1477.5532 1479.8804 1483.0190 1486.5630 1486.7951 2797.3730 2807.8522 2842.9777 2843.1211 2855.3163 2855.6643 2856.9495 2877.4306 2878.4899 2964.9591 2968.1408 3000.3495 3004.3797 3015.5979 3017.0050 3017.1599 3017.8630 3026.0836 3026.2196 3048.0760 3052.4619 3075.9042 3075.9775 3077.1761 3081.8061 3082.0097 3531.5402
redmass: 3.3015 2.5554 3.4769 3.1650 2.8462 2.6925 3.5516 2.2138 2.6272 2.8614 1.2038 1.2907 1.2214 1.1479 1.2504 2.3463 1.9190 2.4581 1.2227 2.9392 2.4940 2.0092 2.0303 2.3131 4.2451 2.2371 2.2128 2.3338 3.1904 3.6135 2.8457 3.2120 4.1382 4.2217 2.7055 2.5932 1.9491 1.5127 2.3202 3.4295 2.2826 2.2673 1.5513 1.5222 1.7964 2.2337 1.9717 2.1978 1.3561 1.3644 1.6159 1.5943 2.1426 1.6729 1.5220 1.6329 1.8322 1.6389 2.0640 1.2786 1.9537 2.3313 1.9929 2.5881 2.2864 1.7945 1.4172 1.4242 1.2753 1.2673 1.4085 1.3746 1.2413 1.4509 1.4495 1.4632 1.3600 1.1429 1.1440 1.1743 1.1641 1.1652 1.0641 1.0494 1.0594 1.0591 1.0650 1.0618 1.0653 1.0709 1.0778 1.0581 1.0827 1.0530 1.0539 1.0546 1.0717 1.0693 1.0572 1.0573 1.0583 1.0582 1.0574 1.0668 1.0668 1.0815 1.0798 1.0889 1.0908 1.0865 1.0721 1.0728 1.0721 1.0715 1.0715 1.0866 1.0889 1.1011 1.1011 1.1010 1.1004 1.1003 1.0656
irintensity: 0.3596 0.0485 1.2317 0.1059 2.5693 0.8060 2.4433 2.2820 1.3351 0.7959 0.4928 0.2912 0.6572 0.2337 0.4819 0.5727 1.0374 8.6636 147.1876 6.3597 18.7137 8.6071 3.0862 0.0279 0.1299 3.2176 0.7169 0.2202 0.1078 27.1211 1.7243 3.8214 48.6926 5.8967 13.5977 5.7376 4.0391 23.2975 1.7628 79.3940 36.4268 9.0506 21.7640 22.5458 8.0798 15.9600 20.5406 2.9096 20.6715 7.4867 38.3760 5.6636 5.5021 6.1135 2.8196 4.3411 18.2003 7.8885 17.9673 2.5522 49.0984 4.1022 3.2516 1.8359 10.8872 1.8808 17.3256 10.7262 8.3216 0.8945 0.0096 4.2310 21.1376 3.2984 9.8011 0.2519 13.4683 0.0138 3.5550 1.3258 2.1441 1.1604 2.7638 28.5044 2.4748 10.7661 6.4623 17.1363 7.6835 15.7482 39.9939 1.8021 4.6399 11.8398 11.9357 18.8347 42.8303 100.5505 8.2135 133.4579 144.1003 241.8658 88.4306 4.9701 221.3393 0.0869 17.3391 18.7542 0.6049 66.9430 31.7377 85.8345 52.6338 6.3078 79.5386 17.5955 25.3036 4.1814 52.2167 38.7631 103.9587 4.4430 4.9014
temp: 298.150 k
press: 1.00000 atm
elementType: 8 7 7 7 6 6 6 6 6 6 6 6 6 6 6 6 1 1 1 1 1 1 1 1 1 1 1 1 1 1 1 1 1 1 1 1 1 1 1 1 1 1 1
symmnumber: 1
zpe: 1008697.3 jmol-1
zpe.correction: 0.384193 hartree
zpe.thermalcorrener: 0.403642 hartree
zpe.thermalcorrenthalpy: 0.404586 hartree
zpe.thermalcorrgfe: 0.336717 hartree
zpe.sumelectzpe: -711.546014 hartree
zpe.sumelectthermal: -711.526565 hartree
zpe.sumelectthermalent: -711.525620 hartree
zpe.sumelectthermalfe: -711.593490 hartree
dipole: -0.0002 0.0154 0.4961
dipole: 0.4963
quadrupole: -93.7235 -106.8679 -97.5217
quadrupole: 0.0007 0.0001 -4.0962
quadrupole: 5.6476 -7.4969 1.8493 0.0007 0.0001 -4.0962
hfenergy: -711.9302063 hartree
pointgroup: C01 [X(C12H27N3O1)]
dipole: -0.0004196 0.0258483 0.1935584 debye
polarizability: 183.7563633|0.1004724|145.5817099|0.0791934|-2.1147604|132.8385219 unknown
InChI: InChI=1S/C12H27N3O/c1-13(2)6-10-8-15(5)9-11(12(10)16)7-14(3)4/h10-12,16H,6-9H2,1-5H3
charge 0 multiplicity 1
43 atoms
O  0.001826 -2.30146 0.336674
N  -0.008403 1.981692 0.101736
N  3.80888 -0.22326 0.080023
N  -3.814873 -0.242498 0.069332
C  1.277051 -0.155294 0.152986
C  -1.283576 -0.161687 0.149434
C  -0.000783 -0.934889 -0.243727
C  1.211307 1.294845 -0.375003
C  -1.223577 1.288982 -0.378079
C  2.545878 -0.874817 -0.356868
C  -2.547335 -0.887373 -0.364258
C  -0.011448 3.418238 -0.234529
C  4.96387 -0.683914 -0.718387
C  4.060969 -0.372053 1.528125
C  -4.070113 -0.39314 1.516691
C  -4.965224 -0.708815 -0.732501
H  1.289953 -0.09863 1.262255
H  -1.299886 -0.105415 1.258676
H  0.001219 -1.130376 -1.334536
H  2.106926 1.839735 -0.029148
H  1.254547 1.271371 -1.499218
H  -1.263974 1.265529 -1.502407
H  -2.122696 1.829401 -0.034303
H  2.502786 -1.948331 -0.045668
H  2.533439 -0.859843 -1.465451
H  -2.5318 -0.87189 -1.472794
H  -2.499713 -1.960784 -0.053338
H  -0.01032 3.614954 -1.337455
H  0.881571 3.90431 0.197512
H  -0.908146 3.899858 0.194875
H  0.000125 -2.207923 1.324807
H  5.17492 -1.778565 -0.606598
H  5.870953 -0.131049 -0.413847
H  4.781716 -0.480338 -1.788642
H  3.249498 0.095073 2.11218
H  5.002016 0.142642 1.792384
H  4.148396 -1.442223 1.849982
H  -4.151982 -1.463904 1.838036
H  -5.014988 0.1158 1.77841
H  -3.263136 0.078758 2.103166
H  -4.78119 -0.503709 -1.802144
H  -5.876034 -0.160885 -0.430186
H  -5.170847 -1.804618 -0.621893
