program: Gaussian 09
title: 000279694
version: EM64L-G09RevD.01
frameworkgroup: C1[X(C18H24N2O4S2)]
method: RPBEPBE
basis: SDD
operation: Freq
keyword: #p
keyword: freq=noraman
keyword: PBEPBE/SDD
title: #p freq=noraman PBEPBE/SDD
converged: YES YES NO NO
title: Mulliken charges:
elementType: S S O O O O N N C C C C C C C C C C C C C C C C C C H H H H H H H H H H H H H H H H H H H H H H H H
charge: 0.926547 0.926559 -0.539711 -0.510565 -0.539706 -0.510567 -0.265720 -0.265709 -0.557193 -0.557268 0.569887 0.569916 -0.406711 -0.406769 -0.365141 -0.365216 -0.601335 -0.596400 -0.601339 -0.596419 -0.226364 -0.226352 -0.232052 -0.232024 -0.237898 -0.237904 0.367988 0.367988 0.243133 0.243145 0.263577 0.263617 0.276230 0.239061 0.221660 0.265228 0.235327 0.233001 0.276236 0.239067 0.221656 0.265254 0.235336 0.232998 0.231718 0.231718 0.232972 0.232976 0.232782 0.232782
chargesum: 0.00000
title: Mulliken charges with hydrogens summed into heavy atoms:
elementType: S S O O O O N N C C C C C C C C C C C C C C C C C C
charge: 0.926547 0.926559 -0.539711 -0.510565 -0.539706 -0.510567 -0.265720 -0.265709 -0.189204 -0.189280 0.569887 0.569916 -0.163578 -0.163624 -0.101564 -0.101599 0.135617 0.137156 0.135620 0.137169 0.005354 0.005366 0.000920 0.000953 -0.005116 -0.005123
polarizability: 3.10905253e+02 1.30073508e-02 3.25123475e+02 1.72085470e+01 1.50329087e-03 2.34132376e+02
1716.lowfreq: -12.0864 -11.3998 -6.3357 -0.0014 0.0005 0.0006 2.4707 3.7212 32.7314
frequency: -9.4776 -5.0848 32.7167 36.2426 36.8151 44.5876 53.3320 62.1122 71.7349 73.1413 82.0158 100.8890 110.0045 142.4395 144.5124 149.8316 150.8254 161.4791 163.1274 174.7735 195.3869 211.4750 216.8358 220.0318 222.1000 253.6812 256.1350 260.8418 275.8628 281.0532 348.0108 351.7067 367.3407 373.8308 385.5688 399.8555 401.9102 406.5945 420.9859 436.2484 483.6223 496.0774 512.5251 534.0570 576.7750 611.1732 615.5175 629.8643 637.6831 696.0941 697.2860 777.0079 786.5351 791.4929 791.6389 807.1519 846.1332 846.6652 848.9129 850.1047 850.6197 919.6314 922.2813 933.0706 933.8938 980.6172 980.7724 989.3066 989.4624 1000.5592 1000.5885 1006.8440 1006.8595 1019.5145 1026.3215 1049.4736 1071.8100 1073.9848 1074.6480 1089.1779 1089.3768 1101.0297 1103.1703 1132.6867 1146.5404 1146.9032 1174.9687 1175.2351 1194.2880 1195.1567 1201.5508 1201.9858 1214.9581 1242.0021 1294.3327 1309.1762 1348.1493 1361.9358 1387.9566 1395.6128 1405.4641 1405.4834 1419.6399 1419.6515 1439.8415 1439.8707 1445.8006 1449.1291 1456.9375 1457.2328 1461.5035 1461.5101 1480.3150 1480.3263 1481.7863 1482.9169 1586.4363 1586.8113 1607.2784 1607.3375 2945.2935 2945.5006 2953.4881 2953.6908 3002.4520 3005.2480 3044.5058 3044.5179 3047.6519 3047.6597 3099.7454 3099.7534 3115.2624 3115.2865 3126.1760 3126.1880 3130.0287 3130.2587 3141.6011 3141.9907 3152.2480 3152.2672 3167.1779 3167.2176
redmass: 4.9502 5.1414 3.3168 2.8427 5.4548 4.7052 4.0240 4.3531 3.8310 3.8474 4.9003 4.2907 3.8424 2.6342 1.2737 1.4818 1.8148 1.3985 5.2681 2.2686 5.0696 4.6431 4.7698 6.6102 6.9272 7.4954 6.0652 5.1066 3.1669 3.1265 4.1825 4.1212 5.9799 5.5320 4.3559 2.8177 2.8848 3.9180 3.5857 4.6936 6.1227 5.3043 4.5145 5.1773 5.0926 6.3898 6.3433 4.6620 4.8229 1.7060 1.5897 1.9343 2.0620 7.4959 14.1885 7.0179 3.8565 3.2798 2.3105 1.8736 1.4179 5.6003 3.3905 1.7069 2.0852 1.4376 1.3913 5.3906 6.2486 1.3292 1.3320 1.4828 1.4832 3.1073 2.1840 2.6413 1.1839 1.2339 1.2208 1.5580 1.6713 1.3870 1.3720 1.2180 4.1570 3.9700 1.0574 1.0547 1.1189 1.1281 1.6298 1.6106 2.1076 2.1994 1.7130 1.5684 1.3177 1.6647 5.7486 3.6047 1.1204 1.1201 1.1251 1.1249 1.0470 1.0473 2.1316 2.0680 1.0499 1.0499 1.0571 1.0572 1.0568 1.0573 2.2354 2.2549 5.8243 5.7761 5.9154 5.8964 1.0396 1.0396 1.0399 1.0399 1.0862 1.0865 1.0958 1.0958 1.0953 1.0953 1.0978 1.0978 1.0972 1.0972 1.0854 1.0854 1.0880 1.0879 1.0921 1.0922 1.0966 1.0966 1.1016 1.1016
irintensity: 3.0210 0.3720 0.2004 2.1231 0.0023 0.2947 0.0846 2.0696 0.0844 0.0241 0.7092 0.5281 1.7300 11.1428 3.0024 1.4234 0.4628 0.6134 10.3595 3.0221 0.9734 4.5646 1.6939 0.4574 2.2648 10.2888 1.6930 0.2133 52.5258 1.7350 8.2029 7.5623 9.8821 8.1749 12.9412 0.8722 1.1881 28.2016 1.4166 3.6769 208.3108 45.7170 17.5894 0.1458 1.2550 0.0272 0.5711 0.0002 9.8288 16.6269 94.6899 31.8311 33.8421 20.2318 42.7756 52.9859 70.8398 19.2267 3.0799 4.4451 5.2013 62.5786 38.2613 17.1958 12.3479 0.0478 0.1669 0.3984 1.0120 0.1474 0.0988 2.3881 2.4232 4.9483 4.5344 0.2231 3.4433 0.4456 0.5124 24.9015 0.0789 9.3077 59.7551 5.6274 11.7277 3.8215 0.3287 0.3245 2.3413 1.4099 30.5975 0.4077 26.9699 30.2423 5.2926 1.8737 11.2700 0.6877 3.2525 0.1457 30.5018 15.7336 1.4492 3.5823 15.2165 21.5968 18.6724 0.0446 12.8080 0.1951 18.1680 1.8559 22.4131 9.7823 7.2945 6.8634 1.5410 1.6250 0.1927 2.2286 96.0753 60.9234 137.6225 8.9520 4.0787 81.1835 11.5664 12.4720 15.9995 26.0180 0.2010 2.5230 10.5607 10.6638 2.8595 0.9375 0.5006 0.0131 13.1811 10.1297 44.4192 0.8125 32.2478 14.8211
temp: 298.150 k
press: 1.00000 atm
elementType: 16 16 8 8 8 8 7 7 6 6 6 6 6 6 6 6 6 6 6 6 6 6 6 6 6 6 1 1 1 1 1 1 1 1 1 1 1 1 1 1 1 1 1 1 1 1 1 1 1 1
symmnumber: 1
zpe: 1014907.5 jmol-1
zpe.correction: 0.386558 hartree
zpe.thermalcorrener: 0.414694 hartree
zpe.thermalcorrenthalpy: 0.415639 hartree
zpe.thermalcorrgfe: 0.327499 hartree
zpe.sumelectzpe: -1904.517840 hartree
zpe.sumelectthermal: -1904.489704 hartree
zpe.sumelectthermalent: -1904.488759 hartree
zpe.sumelectthermalfe: -1904.576899 hartree
dipole: 0.0013 8.2359 -0.0009
dipole: 8.2359
quadrupole: -131.0040 -180.5679 -168.5115
quadrupole: -0.0010 4.5288 0.0020
quadrupole: 29.0238 -20.5401 -8.4837 -0.0010 4.5288 0.0020
hfenergy: -1904.904398 hartree
pointgroup: C01 [X(C18H24N2O4S2)]
dipole: -0.0005546 -3.2402585 -0.0004506 debye
polarizability: 307.9790525|0.0138881|325.1234745|-22.6323725|0.001466|237.0585766 unknown
InChI: InChI=1S/C18H24N2O4S2/c1-19(2)25(21,22)17(15-11-7-5-8-12-15)18(26(23,24)20(3)4)16-13-9-6-10-14-16/h5-14,17-18H,1-4H3
charge 0 multiplicity 1
50 atoms
S  1.82537 1.915969 0.295988
S  -1.824813 1.916327 -0.295568
O  1.579101 1.882244 1.920432
O  1.589215 3.278876 -0.563207
O  -1.578309 1.882801 -1.91998
O  -1.588614 3.279073 0.563872
N  3.621178 1.299325 -0.096866
N  -3.620734 1.299757 0.096917
C  0.593952 0.384035 -0.478401
C  -0.593718 0.384108 0.478739
C  1.418254 -0.850518 -0.607142
C  -1.418334 -0.85025 0.607334
C  1.981604 -1.166407 -1.873112
C  -1.981463 -1.166323 1.873357
C  1.675283 -1.711764 0.495001
C  -1.676111 -1.710984 -0.49504
C  4.366807 2.382877 -0.789087
C  4.269364 0.834281 1.156834
C  -4.366507 2.383324 0.788966
C  -4.26863 0.834652 -1.156912
C  2.768794 -2.323269 -2.040634
C  -2.76904 -2.322941 2.040734
C  2.468912 -2.864042 0.328384
C  -2.470153 -2.8630 -0.328572
C  3.017057 -3.175702 -0.939054
C  -3.017986 -3.174899 0.938941
H  0.356891 0.858909 -1.450787
H  -0.356566 0.858847 1.45117
H  1.79796 -0.501172 -2.725074
H  -1.797322 -0.501433 2.725481
H  1.247776 -1.482894 1.477183
H  -1.248909 -1.481901 -1.477301
H  3.706094 2.885046 -1.514374
H  5.196076 1.898612 -1.337528
H  4.779658 3.151304 -0.102039
H  3.633135 0.091531 1.660846
H  4.499742 1.650701 1.872485
H  5.212161 0.339857 0.856551
H  -3.705949 2.885533 1.514366
H  -5.195878 1.899067 1.337259
H  -4.77923 3.151722 0.10181
H  -3.632287 0.091858 -1.660723
H  -4.498817 1.651032 -1.872669
H  -5.211509 0.340261 -0.85683
H  3.190751 -2.559273 -3.02353
H  -3.190789 -2.55911 3.02368
H  2.658238 -3.52256 1.183249
H  -2.660049 -3.521124 -1.183613
H  3.630087 -4.074885 -1.066454
H  -3.631341 -4.073877 1.066223
