program: Gaussian 09
title: 000279827
version: EM64L-G09RevD.01
frameworkgroup: C1[X(C17H22N4O8S)]
method: RPBEPBE
basis: SDD
operation: Freq
keyword: #p
keyword: freq=noraman
keyword: PBEPBE/SDD
title: #p freq=noraman PBEPBE/SDD
converged: YES YES NO NO
title: Mulliken charges:
elementType: S O O O O O O O O N N N N C C C C C C C C C C C C C C C C C H H H H H H H H H H H H H H H H H H H H H H
charge: 0.179459 -0.316555 -0.257824 -0.400818 -0.293326 -0.445642 -0.212636 -0.197297 -0.239849 -0.376612 -0.385621 -0.653052 0.021532 -0.161411 -0.419795 -0.538097 -0.746162 -0.131665 0.240401 0.237960 -0.831009 0.539602 0.213049 -0.385573 -0.451740 -0.423610 0.394962 -0.181246 -0.377534 0.180516 0.264485 0.247145 0.241385 0.238912 0.240062 0.264544 0.301280 0.368326 0.258134 0.262708 0.326213 0.373528 0.323700 0.295781 0.282025 0.280638 0.294354 0.246934 0.240698 0.287638 0.383255 0.397848
chargesum: 0.00000
title: Mulliken charges with hydrogens summed into heavy atoms:
elementType: S O O O O O O O O N N N N C C C C C C C C C C C C C C C C C
charge: 0.179459 -0.316555 -0.257824 -0.017562 -0.293326 -0.047794 -0.212636 -0.197297 -0.239849 -0.008287 -0.012093 -0.033571 0.021532 0.103074 0.068734 -0.059124 -0.180338 0.126469 0.240401 0.237960 -0.242087 0.539602 0.213049 0.177091 -0.157386 -0.176676 0.394962 0.059452 -0.089896 0.180516
polarizability: 3.56162780e+02 2.37819999e+01 2.62612690e+02 3.21655150e+01 -6.62482396e+00 2.19483968e+02
1716.lowfreq: -11.6633 -3.5607 -0.0017 -0.0016 -0.0013 2.5782 5.2115 16.2631 22.7599
frequency: -4.0078 16.1271 22.5986 25.2621 32.0441 36.9346 42.3455 44.3554 52.0160 62.5285 67.8075 79.1641 83.1259 88.3363 98.5395 105.8792 127.4580 149.2227 167.1155 168.7565 180.2099 209.7459 221.4088 230.0505 241.4278 256.4255 275.4207 290.1697 294.1994 303.7854 335.3092 339.2812 348.1762 385.1398 407.9667 422.8402 424.1484 465.9252 492.1294 493.4338 506.0479 510.5738 522.5456 536.2536 545.4053 561.6907 564.5785 567.3569 620.3157 626.1555 644.1071 650.9006 655.0339 657.7151 692.3546 694.6853 706.6978 714.6577 718.4426 749.2703 754.1340 763.0084 772.1597 817.3922 823.0548 835.1236 859.3861 886.0120 890.2019 928.0774 937.9524 952.0404 958.5479 977.1486 979.4187 990.1910 999.2636 1012.0652 1023.4703 1056.8790 1067.6116 1077.2588 1079.4093 1091.8987 1099.9996 1118.3406 1134.2650 1137.5081 1169.2733 1176.4334 1180.9828 1188.6451 1205.2955 1210.2536 1217.1380 1221.2833 1234.3729 1251.1467 1265.7465 1270.4633 1291.2808 1299.4635 1301.2019 1310.3229 1312.2951 1325.1903 1329.6088 1343.6330 1350.8883 1362.2856 1377.3371 1401.5441 1433.1807 1436.3853 1457.9666 1460.9951 1468.2067 1476.1128 1479.2569 1483.1389 1495.6577 1586.2815 1589.1191 1614.4674 1615.9387 1622.4811 1637.3099 1685.4445 2819.0077 2990.8152 3003.1052 3003.5971 3020.3500 3022.6863 3028.2316 3030.8686 3066.4007 3085.7332 3089.4948 3102.0329 3138.2220 3161.0542 3181.0146 3187.9033 3408.7122 3473.1744 3505.2876 3534.6423 3535.9660 3630.2742
redmass: 7.2124 8.6624 6.4279 7.7015 6.6737 6.8575 6.3475 6.3482 7.2073 6.9436 6.9327 8.1262 5.6707 10.0584 8.1434 6.4767 4.9544 5.4773 5.1575 4.6049 3.9359 4.6917 3.2124 4.7895 3.9177 6.7310 1.4890 5.5148 8.3363 6.2349 3.5595 2.1956 3.4336 6.9723 2.8064 3.3477 3.5640 4.0274 1.9588 4.9400 5.4479 4.2192 1.6331 4.0503 4.0588 4.5727 4.6106 2.5298 1.5106 1.2385 6.0759 2.1540 2.3163 6.6345 2.0705 2.4820 2.6367 5.7368 3.5874 2.0406 8.4560 3.1754 3.1516 1.5111 3.2004 2.2695 2.2449 4.3893 2.8748 1.7407 1.5531 1.4180 4.0647 2.2330 2.3201 5.8658 1.3645 2.1123 2.4179 2.2458 3.4684 2.0676 1.5445 2.1345 2.8949 3.6231 2.1207 1.1291 1.5512 1.1432 1.2512 1.4431 5.0793 1.0852 1.4751 1.5641 3.0318 1.3149 1.2056 1.6693 1.2832 1.4484 1.7907 1.6106 1.7141 1.4518 1.4540 1.5217 1.3585 10.3196 1.6826 6.8098 1.1179 2.6294 1.0841 1.1302 1.1010 1.2084 2.4310 2.0304 1.8385 5.4402 6.2269 6.9168 7.0517 6.1939 1.0954 9.3455 1.0788 1.0612 1.0592 1.0602 1.0606 1.0818 1.0598 1.0982 1.1020 1.1030 1.1090 1.1046 1.0888 1.0937 1.0924 1.0966 1.0807 1.0477 1.0639 1.0759 1.0673 1.0990
irintensity: 0.9655 1.4617 0.5802 2.7842 6.2963 1.9235 2.5576 0.2297 1.1084 0.6597 0.2739 6.8511 3.5867 3.9832 1.2637 8.5472 0.9334 8.6839 0.4789 0.2427 3.3441 0.4933 4.5646 11.3435 5.6777 3.6170 21.5509 1.7652 0.4130 6.0984 7.5551 8.9829 2.4099 1.0790 14.7905 6.0584 2.3829 19.5334 33.3656 4.5912 8.7459 56.2351 185.7968 18.5463 26.6651 9.8799 38.2533 76.6118 135.3234 5.6780 3.0913 122.0371 103.6522 27.1193 33.2177 79.3660 13.2569 5.7664 19.3162 116.2340 14.3900 79.9595 43.9412 29.7932 27.6626 19.0370 3.5313 10.9065 4.3677 0.5459 5.6407 7.1954 18.3235 2.3566 1.8650 1.3269 0.6316 22.6909 4.9840 350.2726 0.8161 179.9105 21.3937 13.8542 8.3947 17.7786 23.2109 3.4903 15.9341 14.7638 18.2967 9.0478 182.6108 0.2945 31.6220 14.4073 70.7419 11.2253 1.8509 14.1588 16.8148 3.1483 16.9306 75.3073 39.8391 15.0684 1.6703 45.1908 7.5155 173.8015 37.9187 8.4861 32.6999 20.3897 8.5524 19.3835 13.7793 10.6640 74.2047 428.3594 126.3597 150.7180 40.3135 6.9592 157.9800 135.0655 54.4250 295.0106 13.9378 26.5375 30.0470 16.0351 15.5299 23.3136 8.0801 5.1131 14.5876 13.1610 9.9791 11.1075 6.5129 14.2674 2.1349 4.9556 174.1541 5.4801 35.1497 20.3656 76.0060 20.8776
temp: 298.150 k
press: 1.00000 atm
elementType: 16 8 8 8 8 8 8 8 8 7 7 7 7 6 6 6 6 6 6 6 6 6 6 6 6 6 6 6 6 6 1 1 1 1 1 1 1 1 1 1 1 1 1 1 1 1 1 1 1 1 1 1
symmnumber: 1
zpe: 1033035.3 jmol-1
zpe.correction: 0.393462 hartree
zpe.thermalcorrener: 0.423808 hartree
zpe.thermalcorrenthalpy: 0.424752 hartree
zpe.thermalcorrgfe: 0.327745 hartree
zpe.sumelectzpe: -1877.575866 hartree
zpe.sumelectthermal: -1877.545520 hartree
zpe.sumelectthermalent: -1877.544576 hartree
zpe.sumelectthermalfe: -1877.641583 hartree
dipole: 0.8774 -2.8675 1.0039
dipole: 3.1624
quadrupole: -211.4557 -160.2381 -186.5210
quadrupole: 9.5211 -28.5038 2.2797
quadrupole: -25.3841 25.8335 -0.4494 9.5211 -28.5038 2.2797
hfenergy: -1877.9693281 hartree
pointgroup: C01 [X(C17H22N4O8S1)]
dipole: 0.4546147 -1.1295693 0.255625 debye
polarizability: 347.6032953|28.1112914|268.5925025|41.0727125|4.5868739|222.06364 unknown
InChI: InChI=1S/C17H22N4O8S/c18-12(17(26)27)4-5-14(22)20-13(16(25)19-7-15(23)24)9-30-8-10-2-1-3-11(6-10)21(28)29/h1-3,6,12-13,19-20,23,26H,4-5,7-9,18H2
charge 0 multiplicity 1
52 atoms
S  -0.425224 -1.136133 1.950415
O  0.784223 -0.030226 -1.578804
O  4.056648 0.163966 2.405052
O  -1.851278 4.025071 2.147112
O  0.251806 3.212702 1.670679
O  5.88675 -0.393679 -2.05964
O  7.946641 0.084637 -1.086051
O  -5.932106 -0.799046 -1.993245
O  -4.082794 0.519286 -1.811729
N  1.577549 0.923499 0.397012
N  4.498917 -0.189197 0.154681
N  -3.107544 2.627026 0.281511
N  -4.713693 -0.59876 -1.62183
C  2.14971 -0.334879 0.893837
C  -1.073284 2.590918 -1.073786
C  0.453164 2.384916 -1.23533
C  1.437405 -0.918501 2.133001
C  -1.672175 2.371666 0.354139
C  0.937205 0.993289 -0.82791
C  3.646899 -0.104235 1.233463
C  -0.504178 -2.340892 0.457881
C  -1.956266 -2.535658 0.098791
C  -0.981545 3.231895 1.407019
C  5.927974 0.081734 0.314172
C  -2.634621 -1.522727 -0.619455
C  -2.671867 -3.697991 0.485771
C  -4.00099 -1.689063 -0.919691
C  -4.038565 -3.856522 0.153013
C  -4.722234 -2.849026 -0.555018
C  6.715188 -0.066584 -0.97506
H  2.07348 -1.043013 0.047462
H  -1.342591 3.613087 -1.396185
H  -1.609835 1.892052 -1.743273
H  0.693604 2.500584 -2.30764
H  1.003127 3.159829 -0.675692
H  1.883071 -1.895222 2.389049
H  1.56628 -0.252443 3.002668
H  1.495999 1.738344 1.02351
H  -1.402921 1.328713 0.670057
H  -0.020605 -3.284069 0.760665
H  0.046899 -1.860962 -0.368946
H  4.149784 -0.381281 -0.787952
H  -3.607855 2.078145 -0.423318
H  -3.595258 2.765596 1.166487
H  6.373172 -0.592695 1.070857
H  6.098017 1.105648 0.702839
H  -2.10619 -0.623658 -0.947705
H  -2.155115 -4.481718 1.051339
H  -4.571554 -4.763855 0.454336
H  -5.779705 -2.935814 -0.817087
H  -1.33305 4.523711 2.836831
H  6.424928 -0.476769 -2.891608
