program: Gaussian 09
title: 000279663
version: EM64L-G09RevD.01
frameworkgroup: C1[X(C17H19NO2)]
method: RPBEPBE
basis: SDD
operation: Freq
keyword: #p
keyword: freq=noraman
keyword: PBEPBE/SDD
title: #p freq=noraman PBEPBE/SDD
converged: YES YES NO NO
title: Mulliken charges:
elementType: O O N C C C C C C C C C C C C C C C C C H H H H H H H H H H H H H H H H H H H
charge: -0.475667 -0.236633 -0.122345 0.073013 -0.421351 0.366048 0.001307 0.305733 -0.396894 -0.376802 -0.612908 -0.604753 -0.222337 -0.249462 -0.363791 -0.356626 -0.241323 -0.228384 -0.255596 -0.225257 0.244478 0.241115 0.281623 0.247019 0.369334 0.202875 0.216087 0.226213 0.257748 0.198209 0.207443 0.226558 0.226766 0.262914 0.310690 0.228570 0.233120 0.231399 0.231866
chargesum: 0.00000
title: Mulliken charges with hydrogens summed into heavy atoms:
elementType: O O N C C C C C C C C C C C C C C C C C
charge: -0.106333 -0.236633 -0.122345 0.073013 0.064242 0.366048 0.001307 0.305733 -0.115271 -0.129783 0.032267 0.058648 0.004221 -0.022695 -0.100877 -0.045936 -0.012754 0.004736 -0.024197 0.006609
polarizability: 2.13233257e+02 -7.66709046e+00 2.03131914e+02 -1.96670612e+01 1.43764177e+01 1.61277396e+02
1716.lowfreq: -10.5737 -7.1332 -0.0010 -0.0004 0.0003 7.7588 30.1928 38.4083 51.4577
frequency: 30.0424 38.3530 51.4391 59.0929 76.0885 89.7715 94.6288 128.2974 179.4958 193.3164 220.0179 227.7953 244.1576 264.6316 273.0294 308.3864 327.9305 354.7269 380.0013 401.9826 407.4084 410.6282 435.4495 459.8714 500.0412 534.4672 578.0820 612.7005 616.0453 617.1323 636.0408 679.9586 702.3363 705.0530 715.1618 764.1356 781.1788 809.1362 860.6538 866.1436 874.4317 908.8238 931.6642 937.7993 957.8729 982.8877 985.3880 990.3796 996.8175 1001.2947 1013.8884 1020.9549 1027.7286 1032.2852 1035.1403 1053.0991 1077.2995 1087.0498 1090.3259 1106.5369 1145.3187 1148.1999 1171.3167 1174.1464 1188.6262 1190.9861 1197.7234 1243.6491 1264.5707 1290.7763 1310.1229 1320.2929 1351.9758 1370.0108 1379.7889 1380.1555 1423.0702 1431.0394 1432.9969 1443.4557 1456.7266 1459.4790 1472.4724 1473.5919 1475.9443 1477.2319 1488.8206 1545.3617 1582.1952 1589.1765 1605.0965 1606.5964 2872.3714 2882.9261 2897.3889 3014.0373 3038.5365 3042.5575 3075.0592 3120.8583 3122.8769 3124.7654 3130.5788 3132.0359 3142.2974 3144.4690 3154.6693 3159.5549 3167.5477 3174.9823 3340.6821
redmass: 4.6601 3.5450 4.5469 2.9522 3.8898 5.3049 4.1289 3.4475 3.3779 2.0026 2.5228 1.3448 2.6484 4.1493 2.6260 3.5711 5.3845 2.8492 3.4834 3.2086 2.9275 4.5198 2.4328 4.2778 3.5140 4.5901 1.1225 5.6087 6.2312 5.5318 5.1541 5.3844 2.2804 2.3275 2.0781 1.8687 2.3755 3.6658 1.2480 1.2555 4.5480 3.6102 1.8298 1.8012 1.9111 2.7506 1.7292 3.1198 1.5377 1.3492 1.5696 2.4093 2.2699 2.1073 1.6431 2.2174 1.7581 1.6250 1.3073 2.0838 1.6990 2.6395 1.0717 1.0560 1.2188 1.1993 2.1514 3.5769 2.6508 1.3724 1.3609 1.3293 1.4336 1.3356 7.6071 8.6850 1.1428 2.2107 2.1968 1.1545 1.0494 1.0938 1.4012 1.5706 1.2113 1.5787 1.0576 8.5975 6.1752 6.1701 6.0422 5.9194 1.0568 1.0668 1.0552 1.0761 1.0826 1.0851 1.1003 1.0888 1.0846 1.0965 1.0880 1.0883 1.0916 1.0937 1.0957 1.0983 1.1007 1.0956 1.0631
irintensity: 0.3101 0.5222 0.2740 0.5168 0.6851 0.4205 1.0540 0.0514 0.3085 0.6461 0.6283 0.9515 3.0684 1.6341 1.3631 1.5148 6.1375 4.3906 12.4829 2.3045 0.8012 27.7985 3.3443 0.2872 4.0095 9.4990 86.4998 30.9062 2.6587 26.9965 21.5314 12.1199 34.1241 29.0865 71.6585 18.4848 24.5754 31.2648 1.0330 0.9575 7.5634 29.9113 14.6671 22.3456 23.9356 0.1998 0.1515 0.9753 0.9773 3.3307 3.0034 39.0242 5.3795 13.9118 6.9288 18.5676 27.8029 13.1315 0.3165 79.6247 4.5137 2.6763 0.4932 0.6810 3.4161 34.3647 10.6513 148.1977 9.0816 30.1453 1.1689 2.7328 138.9144 5.2389 0.4400 0.7066 6.9000 8.9229 9.1564 3.4624 10.2400 14.0522 5.9495 22.9873 25.8429 12.8063 14.5467 92.2186 6.6773 0.7062 7.9371 6.2651 73.6020 67.8012 179.8810 36.3530 41.5473 19.7679 40.7050 27.8507 0.6488 16.8887 6.8133 6.8903 4.9551 28.0643 24.7297 21.8433 28.4770 13.9080 69.8091
temp: 298.150 k
press: 1.00000 atm
elementType: 8 8 7 6 6 6 6 6 6 6 6 6 6 6 6 6 6 6 6 6 1 1 1 1 1 1 1 1 1 1 1 1 1 1 1 1 1 1 1
symmnumber: 1
zpe: 834847.4 jmol-1
zpe.correction: 0.317977 hartree
zpe.thermalcorrener: 0.336770 hartree
zpe.thermalcorrenthalpy: 0.337715 hartree
zpe.thermalcorrgfe: 0.270305 hartree
zpe.sumelectzpe: -862.917823 hartree
zpe.sumelectthermal: -862.899029 hartree
zpe.sumelectthermalent: -862.898085 hartree
zpe.sumelectthermalfe: -862.965494 hartree
dipole: 1.0615 -1.3307 -2.9509
dipole: 3.4066
quadrupole: -111.0025 -108.6704 -119.7065
quadrupole: 1.4154 -5.9979 -0.6375
quadrupole: 2.1240 4.4561 -6.5800 1.4154 -5.9979 -0.6375
hfenergy: -863.2357992 hartree
pointgroup: C01 [X(C17H19N1O2)]
dipole: -0.3775184 0.1911086 -1.2717328 debye
polarizability: 211.5351595|-0.3985148|193.3409703|24.0123944|-21.4045399|172.7664381 unknown
InChI: InChI=1S/C17H19NO2/c1-18(2)13-17(20,15-11-7-4-8-12-15)16(19)14-9-5-3-6-10-14/h3-12,20H,13H2,1-2H3
charge 0 multiplicity 1
39 atoms
O  1.142403 -1.559605 1.846385
O  -0.418795 0.410224 2.3909
N  -1.150706 -2.635138 -0.049332
C  0.621674 -0.899536 0.650641
C  0.164322 -2.011481 -0.327219
C  1.753155 -0.060766 -0.020059
C  -0.457126 0.138245 1.149256
C  -1.361734 0.911189 0.246993
C  3.03532 -0.027528 0.57935
C  1.540086 0.65663 -1.226337
C  -1.536382 -3.534308 -1.16197
C  -1.255977 -3.332468 1.255286
C  4.084152 0.713236 -0.010694
C  2.588952 1.395971 -1.815496
C  -1.520046 2.29965 0.513548
C  -2.094853 0.313527 -0.81267
C  3.866004 1.429476 -1.209436
C  -2.365101 3.086534 -0.294045
C  -2.955738 1.103476 -1.604861
C  -3.082791 2.490776 -1.359308
H  0.117772 -1.58864 -1.346607
H  0.998088 -2.756896 -0.322327
H  3.197251 -0.604145 1.494057
H  0.555607 0.657403 -1.707299
H  0.877698 -0.972086 2.616848
H  -0.842256 -4.402626 -1.282739
H  -1.550204 -2.976178 -2.116874
H  -2.550492 -3.931688 -0.979686
H  -1.030861 -2.641766 2.079638
H  -0.551494 -4.194652 1.33912
H  -2.288803 -3.706564 1.37454
H  5.072235 0.724674 0.463354
H  2.406861 1.947774 -2.7446
H  -0.968808 2.743592 1.348932
H  -2.042597 -0.774707 -0.932327
H  4.679231 2.004586 -1.666411
H  -2.468595 4.15847 -0.093727
H  -3.537178 0.634626 -2.406551
H  -3.745174 3.101417 -1.983373
