program: Gaussian 09
title: 000279621
version: EM64L-G09RevD.01
frameworkgroup: C1[X(C12H13NO2)]
method: RPBEPBE
basis: SDD
operation: Freq
keyword: #p
keyword: freq=noraman
keyword: PBEPBE/SDD
title: #p freq=noraman PBEPBE/SDD
converged: YES YES NO NO
title: Mulliken charges:
elementType: O O N C C C C C C C C C C C C H H H H H H H H H H H H H
charge: -0.275509 -0.379759 0.026102 0.437247 0.268627 -0.462614 -0.194914 -0.472949 0.213679 -0.290884 -0.407099 -0.197976 -0.202165 -0.374697 -0.676101 0.198004 0.210789 0.231752 0.274274 0.220639 0.183860 0.188548 0.225959 0.241061 0.202551 0.232550 0.225434 0.353592
chargesum: 0.00000
title: Mulliken charges with hydrogens summed into heavy atoms:
elementType: O O N C C C C C C C C C C C C
charge: -0.275509 -0.026167 0.026102 0.437247 0.268627 -0.053822 -0.194914 -0.241198 0.213679 -0.016610 -0.186460 0.027983 0.170243 -0.133636 -0.015565
polarizability: 1.83792827e+02 -2.53950430e+00 1.82524514e+02 1.37998954e+01 -1.05667798e+00 7.76567720e+01
1716.lowfreq: -6.4335 -0.0006 0.0007 0.0008 4.5085 8.5184 39.5147 56.2304 67.2253
frequency: 39.5095 56.2284 67.2079 118.4134 130.1770 146.1089 195.5353 231.2332 243.0479 277.1719 290.3321 338.3972 395.8165 422.1475 438.7739 467.1494 476.2611 511.7288 528.4745 553.4103 614.4613 651.6673 677.1424 759.2257 798.9815 804.0241 815.8834 815.9768 829.7138 852.4830 921.5926 936.1970 968.7564 971.8365 982.7681 1020.5611 1028.3897 1053.3158 1058.1085 1116.9259 1135.8148 1143.8892 1166.5412 1198.2529 1198.9931 1239.6038 1249.4162 1258.1081 1275.3801 1328.9989 1343.9072 1379.6605 1390.1290 1392.4669 1403.5231 1420.3508 1459.3199 1474.7306 1482.3509 1482.8457 1493.2269 1503.3845 1562.7697 1602.2724 1613.9660 2902.5677 2913.9570 2958.8228 2965.3071 2994.3024 3091.6610 3101.6432 3114.8855 3119.4414 3139.9684 3149.8212 3173.1860 3558.7209
redmass: 3.6232 4.3823 1.7631 4.7428 4.7173 3.9842 4.0665 1.8677 1.6820 4.7536 3.8882 3.7026 1.2571 2.9651 3.5139 3.2263 7.9522 5.7777 4.0955 5.3507 3.2832 3.8917 6.3511 5.1479 1.5989 1.6172 1.2110 3.5343 3.3474 2.8297 1.4334 1.4142 4.0641 2.1310 1.4209 2.7768 3.5709 3.9249 2.1554 2.1542 1.4203 1.3662 1.4796 1.6812 1.1251 1.9917 1.1567 1.7975 2.3569 1.4511 3.2123 2.1274 1.3750 1.7797 1.5459 3.2821 1.0406 1.0760 1.1410 2.7577 1.0786 4.3085 6.5299 6.3783 7.0212 1.0596 1.0565 1.1051 1.1001 1.0359 1.0991 1.1009 1.0879 1.0893 1.0955 1.0905 1.0986 1.0657
irintensity: 0.0889 0.3143 2.7564 2.4248 7.3166 2.8682 10.1508 1.4782 2.3854 2.3787 5.2622 5.2999 111.4094 14.1690 2.0401 0.0991 0.1046 10.7157 3.7715 2.8456 0.4511 0.8238 4.9195 7.6148 94.0188 3.4978 2.3989 1.6503 24.6144 6.6193 5.7515 0.1697 53.3153 24.4307 2.8818 1.9282 158.9356 122.8519 35.7807 20.2835 12.6180 19.3086 32.7713 28.9116 18.1189 37.3470 0.2758 3.2505 46.1091 12.9573 63.0483 23.8574 11.6148 11.0510 14.7943 28.4486 11.6173 10.4990 0.3635 8.5919 6.1790 35.8905 76.7503 7.5187 2.0135 23.6899 132.8771 78.0024 27.1912 25.1552 39.6129 33.2636 20.6421 20.8558 19.8415 17.2123 16.9010 41.2706
temp: 298.150 k
press: 1.00000 atm
elementType: 8 8 7 6 6 6 6 6 6 6 6 6 6 6 6 1 1 1 1 1 1 1 1 1 1 1 1 1
symmnumber: 1
zpe: 586106.3 jmol-1
zpe.correction: 0.223236 hartree
zpe.thermalcorrener: 0.236937 hartree
zpe.thermalcorrenthalpy: 0.237882 hartree
zpe.thermalcorrgfe: 0.182224 hartree
zpe.sumelectzpe: -669.161411 hartree
zpe.sumelectthermal: -669.147710 hartree
zpe.sumelectthermalent: -669.146766 hartree
zpe.sumelectthermalfe: -669.202423 hartree
dipole: -3.1613 -2.1971 -1.6049
dipole: 4.1710
quadrupole: -84.2596 -71.2343 -91.4312
quadrupole: -9.7692 3.8307 -1.5347
quadrupole: -1.9513 11.0741 -9.1228 -9.7692 3.8307 -1.5347
hfenergy: -669.3846472 hartree
pointgroup: C01 [X(C12H13N1O2)]
dipole: 1.330679 -0.5964219 0.7525912 debye
polarizability: 182.5797267|4.8182246|181.7474205|15.0164294|-12.5108717|79.6469662 unknown
InChI: InChI=1S/C12H13NO2/c1-2-15-8-9-5-6-11(14)12-10(9)4-3-7-13-12/h3-7,14H,2,8H2,1H3
charge 0 multiplicity 1
28 atoms
O  2.759688 -0.020886 -0.189126
O  -3.516181 -1.597096 -0.404502
N  -2.597322 0.982816 -0.411351
C  0.581328 -0.861328 0.542917
C  -0.303788 0.227805 0.212202
C  2.017909 -0.615629 0.943059
C  -1.698254 -0.024084 -0.102089
C  0.070148 -2.16258 0.53184
C  -2.171654 -1.389675 -0.0941
C  0.129448 1.595321 0.170903
C  -1.291837 -2.435091 0.215933
C  -0.784134 2.604689 -0.135678
C  4.1706 0.227472 0.151588
C  -2.140567 2.24949 -0.417571
C  4.834105 0.853665 -1.074479
H  2.079547 0.077772 1.814196
H  2.494803 -1.574301 1.240186
H  0.731825 -3.00266 0.772973
H  1.184604 1.821996 0.346799
H  -1.650268 -3.472571 0.21907
H  4.233377 0.906612 1.032739
H  4.664837 -0.731462 0.426578
H  -0.478153 3.654964 -0.176554
H  -2.876332 3.024943 -0.663786
H  5.902134 1.057718 -0.875765
H  4.760218 0.173912 -1.940509
H  4.338367 1.803383 -1.339919
H  -3.728349 -2.564594 -0.374953
