program: Gaussian 09
title: 000279590
version: EM64L-G09RevD.01
frameworkgroup: C1[X(C15H12N2O)]
method: RPBEPBE
basis: SDD
operation: Freq
keyword: #p
keyword: freq=noraman
keyword: PBEPBE/SDD
title: #p freq=noraman PBEPBE/SDD
converged: YES YES NO NO
title: Mulliken charges:
elementType: O N N C C C C C C C C C C C C C C C H H H H H H H H H H H H
charge: -0.436128 -0.482855 -0.084375 0.352094 -0.198988 0.481180 0.466412 -0.381241 -0.457698 -0.232617 -0.326850 -0.421640 -0.342745 -0.180545 -0.383133 -0.325459 -0.387752 0.274810 0.341928 0.247038 0.233527 0.221647 0.244743 0.239160 0.247322 0.229102 0.242755 0.250681 0.218021 0.351608
chargesum: 0.00000
title: Mulliken charges with hydrogens summed into heavy atoms:
elementType: O N N C C C C C C C C C C C C C C C
charge: -0.084520 -0.140927 -0.084375 0.352094 -0.198988 0.481180 0.466412 -0.134203 -0.224171 -0.010970 -0.082108 -0.182480 -0.095423 0.048557 -0.140379 -0.074778 -0.169730 0.274810
polarizability: 3.38029734e+02 3.84814931e+00 1.98454858e+02 -2.02957783e+00 5.41964072e+00 7.78536697e+01
1716.lowfreq: -0.0008 -0.0005 -0.0004 2.8852 6.5610 7.8078 33.9635 38.7359 79.7229
frequency: 33.9305 38.7051 79.7192 131.8720 157.6575 181.8888 203.6197 248.1158 283.5340 333.7749 359.3790 395.1567 412.6131 419.1256 427.1649 471.7110 496.8630 503.5662 517.0768 545.2657 578.2533 619.1668 639.3095 646.2775 704.8392 743.9091 752.7978 755.9941 771.1502 796.2782 798.1899 802.0641 820.6243 832.8254 839.2807 869.2548 892.9402 923.3150 934.8111 947.7509 967.8235 986.7093 996.8379 1030.5915 1063.2085 1079.5671 1108.4518 1140.4269 1143.8902 1177.4328 1191.2044 1222.1130 1236.0779 1243.2292 1259.5587 1295.2599 1326.7622 1355.7562 1370.9010 1390.8028 1413.9280 1415.3309 1438.7959 1455.4771 1486.6464 1510.7565 1536.9941 1570.6047 1591.4097 1599.1637 1617.3959 1634.1097 3115.2027 3127.6168 3128.0467 3132.2355 3134.3318 3150.6887 3167.9732 3171.2368 3174.0852 3183.5682 3381.4466 3586.0343
redmass: 4.3659 5.8264 4.8086 5.6646 5.4244 4.4768 6.0923 4.6731 5.5348 1.1103 5.6888 4.1269 3.1322 4.4849 3.7742 3.2659 5.5994 4.6072 3.5797 6.5669 3.6608 6.6110 5.2021 3.6143 3.9040 2.4064 1.4442 2.4488 2.1585 1.6945 3.0160 2.0133 2.4148 2.1091 2.5659 1.4534 5.5417 1.3186 1.4337 1.3533 1.3206 1.3766 2.7923 3.0250 2.3880 2.1892 1.4463 1.3409 1.3430 1.1167 1.2062 1.8829 1.7642 2.0684 2.6897 2.2529 1.7343 1.9620 3.1880 2.9390 2.1616 5.3438 3.5157 2.7620 3.2465 2.8215 2.7225 5.8176 6.1352 4.7755 6.3274 6.4684 1.0901 1.0865 1.0871 1.0897 1.0919 1.0957 1.0991 1.0947 1.0953 1.0930 1.0749 1.0660
irintensity: 0.9479 0.7025 0.5496 1.3886 3.2012 2.8197 2.1145 7.6656 3.3511 143.9767 0.5783 7.4639 0.5439 2.4168 5.5459 1.0813 29.6432 10.9292 18.1081 20.9585 2.0681 2.9256 1.9078 1.3312 2.5831 32.1960 37.8414 47.4097 23.6181 34.6285 16.9289 4.7095 33.8641 121.6541 10.9278 3.6423 1.5526 0.4853 0.7804 0.2220 0.9845 1.4324 1.0402 0.6912 2.0654 31.8765 75.8404 7.9360 262.7897 2.9854 19.4766 7.8621 1.7595 47.9488 9.1092 1.7937 30.6053 1.9620 23.3592 5.1311 20.0839 99.6500 45.9063 54.7170 11.6028 324.8806 430.3307 298.7399 40.1743 83.6507 72.6570 1.2266 29.9605 0.7134 10.4176 9.4680 16.7637 32.4707 39.8046 13.2560 2.9702 7.6470 91.3546 56.6664
temp: 298.150 k
press: 1.00000 atm
elementType: 8 7 7 6 6 6 6 6 6 6 6 6 6 6 6 6 6 6 1 1 1 1 1 1 1 1 1 1 1 1
symmnumber: 1
zpe: 611408.1 jmol-1
zpe.correction: 0.232873 hartree
zpe.thermalcorrener: 0.246853 hartree
zpe.thermalcorrenthalpy: 0.247797 hartree
zpe.thermalcorrgfe: 0.191327 hartree
zpe.sumelectzpe: -762.298402 hartree
zpe.sumelectthermal: -762.284422 hartree
zpe.sumelectthermalent: -762.283478 hartree
zpe.sumelectthermalfe: -762.339948 hartree
dipole: -1.5012 1.4950 0.6591
dipole: 2.2188
quadrupole: -88.0446 -91.8769 -110.2819
quadrupole: 10.9095 3.7310 3.0907
quadrupole: 8.6899 4.8576 -13.5474 10.9095 3.7310 3.0907
hfenergy: -762.5312753 hartree
pointgroup: C01 [X(C15H12N2O1)]
dipole: 0.5902754 -0.5610861 0.31429 debye
polarizability: 338.0784941|3.0141654|195.9321619|-0.9518923|-17.9894172|80.3276055 unknown
InChI: InChI=1S/C15H12N2O/c18-13-8-6-12(7-9-13)17-14-5-1-3-11-4-2-10-16-15(11)14/h1-10,17-18H
charge 0 multiplicity 1
30 atoms
O  -6.012554 0.089312 0.151904
N  -0.36807 0.506067 -0.10809
N  2.063709 1.575228 -0.039861
C  0.67792 -0.407207 -0.051925
C  2.005147 0.193297 -0.01332
C  3.183006 -0.639267 0.034689
C  -1.767163 0.31872 -0.030921
C  0.583484 -1.815309 -0.076076
C  3.041703 -2.063504 0.032443
C  1.759733 -2.619579 -0.033991
C  4.448081 0.034449 0.0742
C  -2.605461 1.310882 -0.618357
C  -2.383095 -0.765886 0.650046
C  4.497349 1.431242 0.056075
C  3.273282 2.16757 -0.006188
C  -4.00563 1.222869 -0.538988
C  -3.789473 -0.863792 0.719837
C  -4.603872 0.125772 0.123011
H  -0.012967 1.47143 -0.192225
H  -0.387945 -2.30572 -0.16695
H  3.933013 -2.6990 0.072319
H  1.643065 -3.709175 -0.058816
H  5.368751 -0.55933 0.114808
H  -2.14716 2.154563 -1.147625
H  -1.774735 -1.510123 1.169377
H  5.450765 1.967614 0.084798
H  3.2831 3.263194 -0.031057
H  -4.647359 1.984762 -0.990775
H  -4.243919 -1.707917 1.255158
H  -6.332406 -0.709261 0.639899
