program: Gaussian 09
title: 000279575
version: EM64L-G09RevD.01
frameworkgroup: C1[X(C14H12ClNO4)]
method: RPBEPBE
basis: SDD
operation: Freq
keyword: #p
keyword: freq=noraman
keyword: PBEPBE/SDD
title: #p freq=noraman PBEPBE/SDD
converged: YES YES NO NO
title: Mulliken charges:
elementType: Cl O O O O N C C C C C C C C C C C C C C H H H H H H H H H H H H
charge: 0.005018 -0.224409 -0.270910 -0.212223 -0.209714 0.020362 -0.312138 -0.296944 0.496236 -0.295242 -0.282428 0.369885 0.405096 -0.356870 -0.388294 -0.342406 -0.373318 -0.225655 -0.195753 -0.253304 0.240775 0.214502 0.205124 0.235054 0.264476 0.311971 0.289044 0.244558 0.251678 0.225371 0.230104 0.230356
chargesum: 0.00000
title: Mulliken charges with hydrogens summed into heavy atoms:
elementType: Cl O O O O N C C C C C C C C C C C C C C
charge: 0.005018 -0.224409 -0.270910 -0.212223 -0.209714 0.020362 0.143139 0.143234 0.496236 -0.295242 -0.017952 0.369885 0.405096 -0.044899 -0.099250 -0.097848 -0.121641 -0.000284 0.034351 -0.022948
polarizability: 3.00600363e+02 2.14331456e+01 1.59038105e+02 -2.03029668e+01 4.36650665e+00 1.26246792e+02
1716.lowfreq: -5.8621 -1.7148 -0.0024 -0.0023 -0.0019 4.2560 17.6738 18.4299 29.3972
frequency: 17.3492 18.2325 29.3379 59.2628 73.5817 81.7489 115.1052 141.7325 156.6062 168.3519 173.4418 232.4627 243.1791 280.2351 319.6147 337.0374 355.5847 410.6522 411.4717 446.9736 458.1592 484.0038 501.9993 534.8065 550.7119 594.5810 610.0405 634.4505 686.3873 689.3362 693.1841 731.4039 746.5645 758.8913 765.7965 821.8376 821.8637 838.9157 890.5611 904.1095 919.7785 921.6562 961.8966 970.8482 983.2660 984.9620 1021.3144 1025.8384 1033.1451 1043.3974 1085.1609 1104.2719 1109.3202 1144.3450 1168.4875 1181.2688 1205.5975 1209.6007 1217.5852 1245.7922 1263.0041 1264.8176 1316.0027 1355.0253 1362.5014 1380.2162 1392.5364 1402.0666 1418.6513 1443.9047 1449.6172 1458.2456 1477.0389 1481.8427 1578.3479 1593.5529 1601.7714 1612.8240 2960.0972 2983.0208 3028.8232 3056.1500 3130.3900 3139.1800 3155.0695 3163.9510 3169.3860 3174.4137 3187.6774 3190.4924
redmass: 8.0935 7.2856 4.3496 12.2332 6.9438 7.0472 6.1146 8.7656 3.9292 7.7298 5.7437 5.0878 3.0169 3.7836 7.3480 8.5698 7.4947 2.9501 4.1217 3.3236 4.6574 8.4007 2.8858 4.6036 5.3561 5.3418 6.4508 6.5749 5.5377 3.7351 2.8528 4.2694 5.5164 1.6930 3.9101 1.3026 1.5339 6.1798 1.4677 3.4410 3.4293 1.4223 1.3646 1.3524 5.1494 1.3481 2.1629 2.4566 2.6331 2.4467 1.5386 3.3974 2.3087 1.2750 1.0818 1.1691 1.1089 5.1438 3.5350 2.2247 1.6700 1.2986 1.3263 6.6434 1.3298 2.6990 5.3445 2.7417 5.2313 2.2669 1.1917 1.1816 2.3632 2.0586 8.0599 6.4254 7.3782 6.3093 1.0576 1.0577 1.1040 1.1063 1.0848 1.0887 1.0924 1.0960 1.0884 1.1007 1.0930 1.0962
irintensity: 0.6128 0.2251 0.1672 0.0736 1.7881 1.4959 1.4783 4.9469 3.4748 2.1627 0.9913 0.7615 4.1304 1.2201 0.2646 1.6288 1.8734 0.0320 0.0487 5.0134 2.6564 1.9238 12.0420 0.4728 1.6909 3.1764 0.4499 23.7216 14.0195 34.5027 49.0907 8.0411 1.1428 92.2254 20.7137 1.7920 34.5676 10.1033 4.0704 23.3727 135.9559 31.2796 0.3790 1.6768 0.2290 0.6834 2.7723 20.5538 67.2294 21.8201 16.1777 30.1409 6.3472 62.3968 11.7706 52.1127 7.6126 805.6528 85.5696 263.3807 69.3329 3.3370 0.8907 43.0656 18.2346 10.3622 44.9814 51.1021 19.1097 6.0535 70.9327 116.3526 57.5923 56.1476 14.4403 37.0067 170.0891 54.6160 26.1349 40.5617 27.5377 24.8275 4.1260 9.3069 34.2093 19.8464 5.2962 6.6640 5.7481 7.9370
temp: 298.150 k
press: 1.00000 atm
elementType: 17 8 8 8 8 7 6 6 6 6 6 6 6 6 6 6 6 6 6 6 1 1 1 1 1 1 1 1 1 1 1 1
symmnumber: 1
zpe: 613192.1 jmol-1
zpe.correction: 0.233553 hartree
zpe.thermalcorrener: 0.251427 hartree
zpe.thermalcorrenthalpy: 0.252371 hartree
zpe.thermalcorrgfe: 0.183996 hartree
zpe.sumelectzpe: -1354.847454 hartree
zpe.sumelectthermal: -1354.829580 hartree
zpe.sumelectthermalent: -1354.828636 hartree
zpe.sumelectthermalfe: -1354.897011 hartree
dipole: 6.0428 -3.3413 -2.3386
dipole: 7.2903
quadrupole: -156.8539 -119.2300 -116.2210
quadrupole: 1.6884 2.0139 5.2948
quadrupole: -26.0856 11.5383 14.5473 1.6884 2.0139 5.2948
hfenergy: -1355.0810066 hartree
pointgroup: C01 [X(C14H12Cl1N1O4)]
dipole: 2.3560234 -1.5682368 0.4652743 debye
polarizability: 304.2312528|2.9656045|147.0823449|-16.1510754|-16.3486217|134.5716619 unknown
InChI: InChI=1S/C14H12ClNO4/c15-13-10-11(16(17)18)6-7-14(13)20-9-8-19-12-4-2-1-3-5-12/h1-7,10H,8-9H2
charge 0 multiplicity 1
32 atoms
Cl -1.210327 1.315079 -2.534128
O  -0.212494 -0.654323 -0.581245
O  2.485524 -0.336621 0.67402
O  -6.489124 -0.454182 0.65047
O  -6.321811 1.051382 -1.058723
N  -5.80731 0.200384 -0.232636
C  0.483438 -1.609048 0.307641
C  1.965695 -1.521994 -0.011043
C  -1.578216 -0.495985 -0.436459
C  -2.211862 0.430044 -1.317951
C  -2.376322 -1.188282 0.515366
C  3.846187 -0.019798 0.486086
C  -4.353342 -0.040582 -0.3003
C  -3.588508 0.664301 -1.259718
C  -3.761666 -0.963183 0.586946
C  4.744439 -0.788653 -0.294114
C  4.288803 1.150072 1.150533
C  6.092903 -0.37286 -0.401157
C  5.634596 1.548736 1.034007
C  6.545984 0.7901 0.257825
H  0.309641 -1.339595 1.366722
H  0.104117 -2.631193 0.108577
H  2.478608 -2.433552 0.361741
H  2.114064 -1.443542 -1.106241
H  -1.91674 -1.903413 1.202047
H  -4.078444 1.372505 -1.932268
H  -4.389207 -1.485647 1.313038
H  4.417971 -1.693537 -0.815653
H  3.569083 1.724868 1.741349
H  6.787869 -0.96617 -1.006011
H  5.972952 2.455053 1.548166
H  7.591001 1.104137 0.168715
