program: Gaussian 09
title: 000279569
version: EM64L-G09RevD.01
frameworkgroup: C1[X(C12H7Cl2NO3)]
method: RPBEPBE
basis: SDD
operation: Freq
keyword: #p
keyword: freq=noraman
keyword: PBEPBE/SDD
title: #p freq=noraman PBEPBE/SDD
converged: YES YES NO NO
title: Mulliken charges:
elementType: Cl Cl O O O N C C C C C C C C C C C C H H H H H H H
charge: 0.038128 -0.059468 -0.153317 -0.168395 -0.195657 -0.447282 0.306883 0.266614 0.622253 -0.098018 0.061179 -0.643452 -0.361810 -0.355578 -0.220877 -0.221401 0.283482 -0.670970 0.289389 0.291932 0.340227 0.244981 0.245349 0.305708 0.300100
chargesum: 0.00000
title: Mulliken charges with hydrogens summed into heavy atoms:
elementType: Cl Cl O O O N C C C C C C C C C C C C
charge: 0.038128 -0.059468 -0.153317 -0.168395 -0.195657 -0.107055 0.306883 0.266614 0.622253 -0.098018 0.061179 -0.643452 -0.072421 -0.063646 0.024103 0.023947 0.283482 -0.065161
polarizability: 2.46570345e+02 1.63360937e-01 2.03377641e+02 -6.60549846e+00 -6.13410834e-01 7.63420471e+01
1716.lowfreq: -6.4819 -2.9975 -0.0017 -0.0015 0.0002 3.4850 25.9338 43.1595 59.7072
frequency: 25.9057 43.1521 59.7037 62.5397 85.5369 116.7583 131.1989 165.7927 178.0168 204.6815 256.1141 288.8798 296.2068 334.8874 360.3627 366.0034 407.2818 417.5826 429.7980 479.0484 514.0809 548.1099 559.3194 611.9214 647.0835 668.7409 696.9135 700.9441 705.7786 729.1678 802.3417 812.7468 827.9540 835.3101 907.4981 923.5315 936.3337 991.3581 993.5577 1013.9871 1039.2605 1083.8884 1120.4401 1151.5844 1174.6632 1188.1520 1229.5798 1254.3056 1261.2424 1283.6617 1328.9826 1401.1966 1417.1802 1439.7010 1470.8045 1471.4550 1545.2127 1564.2585 1582.1716 1600.8024 1608.2906 1633.8087 3067.2871 3142.0648 3155.7524 3157.4107 3165.9838 3175.8771 3429.9401
redmass: 11.6249 9.3577 9.6656 3.2482 10.4735 5.4385 9.5781 11.7706 7.2890 10.4497 6.1990 12.2414 6.8710 12.6028 10.3351 10.5063 7.0990 5.2264 4.1685 9.6372 4.6578 7.6377 3.2815 4.0020 2.4120 2.7227 5.9291 3.8872 6.8038 3.2037 1.7894 6.5802 4.6147 6.7629 1.7805 1.7039 4.9446 5.5551 1.4523 1.3653 2.1844 2.8588 2.9748 1.1451 1.0746 3.3451 2.2215 2.5139 1.4055 1.9450 5.1777 10.0927 1.0870 2.3920 2.0045 2.4694 10.4521 9.9578 9.3362 9.0468 7.1310 7.7081 1.0580 1.0866 1.0903 1.1076 1.0949 1.1006 1.0762
irintensity: 0.2168 1.9456 2.5269 11.7789 3.7180 0.3510 3.5114 1.6311 0.6782 2.0703 0.5296 1.1746 1.0711 1.4083 17.2401 11.6280 13.8236 3.9393 1.3211 7.6477 12.9833 11.6744 2.7739 14.5719 68.9728 52.2806 76.4260 46.3571 1.2172 12.9542 59.0533 88.7528 5.0645 2.0348 11.4139 2.7991 17.0204 16.0966 5.4974 0.2375 2.3797 2.0835 103.0821 3.9341 8.0214 20.6674 97.0964 311.5830 64.7006 16.4043 201.2855 0.1416 31.5907 15.5339 293.5323 79.6777 76.4868 158.1375 254.1905 127.6977 11.0821 126.8301 1.7790 3.4640 3.9882 0.7300 0.9217 22.4782 121.8677
temp: 298.150 k
press: 1.00000 atm
elementType: 17 17 8 8 8 7 6 6 6 6 6 6 6 6 6 6 6 6 1 1 1 1 1 1 1
symmnumber: 1
zpe: 432336.9 jmol-1
zpe.correction: 0.164668 hartree
zpe.thermalcorrener: 0.180541 hartree
zpe.thermalcorrenthalpy: 0.181485 hartree
zpe.thermalcorrgfe: 0.119151 hartree
zpe.sumelectzpe: -1660.766532 hartree
zpe.sumelectthermal: -1660.750660 hartree
zpe.sumelectthermalent: -1660.749716 hartree
zpe.sumelectthermalfe: -1660.812050 hartree
dipole: -1.6001 -1.6291 -0.5335
dipole: 2.3450
quadrupole: -92.2021 -127.3246 -120.4657
quadrupole: 7.0005 0.3863 1.0075
quadrupole: 21.1287 -13.9938 -7.1350 7.0005 0.3863 1.0075
hfenergy: -1660.9312009 hartree
pointgroup: C01 [X(C12H7Cl2N1O3)]
dipole: 0.6092043 -0.6633117 0.200086 debye
dipolederiv: -0.2894101 0.4359157 -0.0400636 0.3031888 -0.5881697 0.0762881 -0.0177926 0.0537028 -0.0123346 -0.4888605 0.0513504 0.1090195 0.2690717 -0.3324417 -0.1598646 0.1726477 -0.0966024 -0.2297742 -0.7081252 -0.0482181 0.1276707 -0.1848212 -0.7107082 0.2428143 0.1190215 0.1957616 -0.3897393 -0.6510065 -0.2187862 0.0420391 -0.1416285 -0.8780113 0.0745157 0.0905291 0.1171636 -0.3080506 -0.6272698 0.1752104 0.2145945 -0.4513449 -0.7161752 -0.2320217 -0.1747225 -0.3694026 -0.5425321 -1.8383335 -0.7181387 -0.0231816 -0.5709697 -0.6418105 -0.1160431 -0.1018265 -0.1284505 -0.4258342 -0.6662408 0.057672 0.1151319 -0.0264848 0.0394445 0.0208337 0.09994 -0.0058038 -0.0132033 -0.2827586 0.2669068 -0.0283215 0.3653399 -0.3201592 -0.0048651 -0.0377044 -0.0056515 0.0192831 1.1350583 0.7713256 -0.0688994 0.6292272 -0.5077374 0.0479671 -0.2192991 0.0002574 0.1293629 1.306438 -0.4480213 -0.1805417 -0.071687 1.0193879 -0.3515768 -0.0751801 -0.1594866 0.3124406 1.586707 0.2124245 -0.1123917 -0.0519275 0.8681422 -0.0576079 -0.2187778 -0.1021604 0.2169858 -0.734903 -0.789735 0.1045009 -0.9248644 0.8153795 -0.0922347 0.1275928 -0.1602299 -0.1012308 -0.101761 0.208505 -0.0358226 -0.0112771 0.0425933 -0.0179211 0.0443529 -0.0662715 -0.0863446 -0.1078319 0.0025041 0.0206379 0.2340679 0.0361398 -0.0643805 -0.0279576 -0.0249128 -0.0860732 0.0538504 -0.2010347 -0.0055586 -0.0953431 0.0807455 -0.0124546 -0.020008 0.0063864 -0.1305148 0.2046773 0.0234357 -0.0711019 -0.0730324 -0.0495392 0.0133194 -0.0562854 -0.0142982 -0.1229076 1.4635922 0.2723688 -0.1733659 1.3438404 1.127046 0.3910229 0.2969669 0.5017873 0.5897412 0.1178965 -0.1707158 -0.0575204 -0.5103814 0.4198734 0.2529783 -0.1148826 0.1645527 0.2188269 0.0909566 -0.0783972 0.0217412 -0.0177452 0.0436109 0.0197471 0.0042701 0.0399975 0.1454619 0.1205503 0.0026213 0.0118962 -0.0712342 0.0277675 0.0328588 0.0208445 0.019517 0.1469134 0.4071393 0.0122677 -0.047444 -0.1339596 0.1162979 -0.0372986 0.0416341 0.0527982 0.3063499 0.0216383 0.0885709 0.0103144 0.1041486 -0.0286707 0.0114892 0.0065266 0.0086964 0.1545049 -0.0984774 0.0049558 0.0469408 -0.0020038 0.0946064 0.0113171 0.0474802 0.0098492 0.1474235 0.061464 0.0499362 0.0278383 0.0420299 -0.0041938 0.0222729 0.054414 0.0224972 0.040781 0.0250102 0.037076 -0.0081124 0.0477905 0.0465822 -0.0711561 -0.0617839 -0.059697 0.020464 unknown
polarizability: 243.2667597|-4.4158791|202.9973008|-23.5267841|-8.3301676|80.025973 unknown
InChI: InChI=1S/C12H7Cl2NO3/c13-5-8(16)15-10-9(14)11(17)6-3-1-2-4-7(6)12(10)18/h1-4,15H,5H2
charge 0 multiplicity 1
25 atoms
Cl -1.201274 3.101547 -0.122809
Cl -5.091213 0.733634 1.10135
O  -0.447903 -1.835723 1.110323
O  1.785169 2.907446 -0.402189
O  -2.516119 -1.697793 -0.867463
N  -2.194797 0.263942 0.396241
C  1.498577 -0.733787 0.19447
C  2.087296 0.519275 -0.13223
C  -0.806271 0.386726 0.244679
C  0.050992 -0.82892 0.531966
C  1.268561 1.772885 -0.174689
C  -0.198068 1.602996 0.014904
C  2.299634 -1.899135 0.244754
C  3.473371 0.59632 -0.404637
C  3.679082 -1.818711 -0.04003
C  4.265886 -0.570432 -0.36468
C  -2.953191 -0.800544 -0.102423
C  -4.419335 -0.858841 0.326773
H  1.824714 -2.849145 0.508675
H  3.904039 1.5739 -0.642301
H  -2.718922 1.065419 0.773734
H  4.297443 -2.721664 -0.007785
H  5.337246 -0.509862 -0.582278
H  -4.545258 -1.640929 1.091522
H  -5.050358 -1.069906 -0.546877
