program: Gaussian 09
title: 000279594
version: EM64L-G09RevD.01
frameworkgroup: C1[X(C22H25N3O2)]
method: RPBEPBE
basis: SDD
operation: Freq
keyword: #p
keyword: freq=noraman
keyword: PBEPBE/SDD
title: #p freq=noraman PBEPBE/SDD
converged: YES YES NO NO
title: Mulliken charges:
elementType: O O N N N C C C C C C C C C C C C C C C C C C C C C C H H H H H H H H H H H H H H H H H H H H H H H H H
charge: -0.441414 -0.269172 -0.099402 -0.499631 -0.068766 -0.370092 -0.355885 -0.403551 -0.391335 -0.396539 -0.469609 0.340443 -0.515309 0.067397 0.495324 -0.364283 -0.465427 0.396896 -0.280193 0.551574 -0.499566 0.335888 -0.627261 -0.342169 -0.185053 -0.390773 -0.534825 0.175047 0.228384 0.209391 0.165206 0.226268 0.188624 0.186973 0.206734 0.209253 0.185545 0.228617 0.224645 0.289332 0.214313 0.236808 0.342249 0.353304 0.269919 0.245519 0.241088 0.226340 0.241080 0.222332 0.222092 0.243668
chargesum: 0.00000
title: Mulliken charges with hydrogens summed into heavy atoms:
elementType: O O N N N C C C C C C C C C C C C C C C C C C C C C C
charge: -0.088110 -0.269172 -0.099402 -0.157382 -0.068766 0.033339 0.018711 0.011342 0.002372 -0.001741 -0.016347 0.340443 -0.225977 0.067397 0.495324 -0.149970 -0.228619 0.396896 -0.280193 0.551574 -0.229647 0.335888 -0.381742 -0.101081 0.041287 -0.149693 0.153267
polarizability: 3.99822034e+02 1.53652561e+01 3.39564452e+02 1.23405335e+01 1.75972870e+00 1.50226304e+02
1716.lowfreq: -4.2850 -3.2517 -0.0010 -0.0007 -0.0004 4.4656 14.8892 27.8817 36.3931
frequency: 14.7027 27.8356 36.3567 42.6138 53.0118 72.1600 85.3047 113.6059 123.6949 142.3875 167.7379 176.2622 194.2142 212.9373 222.5923 226.7163 238.0351 246.3927 266.2309 305.3499 310.6493 318.0368 329.6084 362.7743 370.8322 387.7436 416.7097 433.4543 436.4595 443.9353 447.1306 482.2879 501.2653 514.7524 537.0054 553.6860 567.6170 579.5385 600.6888 617.3292 625.3898 651.0782 674.1684 712.8548 740.4957 760.9273 766.1996 770.9475 773.0736 788.5300 801.5969 804.3823 806.2203 835.5986 851.8568 856.0357 859.5953 886.5691 896.1284 909.8599 925.3372 926.8258 935.5750 958.5286 962.8813 980.3392 989.1400 995.5789 1021.4695 1046.1156 1046.8246 1068.3971 1081.5534 1091.4160 1111.4100 1112.8308 1122.3649 1131.3706 1147.8091 1150.9304 1154.4035 1159.2558 1169.2941 1177.9660 1192.5310 1223.7332 1229.3055 1235.0670 1253.7191 1264.0518 1267.1739 1277.7668 1291.1708 1292.9056 1299.7426 1329.2443 1338.0773 1341.9568 1346.4841 1351.5815 1364.1987 1372.6384 1382.6288 1401.9553 1414.9849 1420.3315 1436.4835 1450.3026 1452.1711 1458.2657 1462.1228 1463.1497 1464.7144 1466.6119 1470.6652 1473.4674 1476.6804 1479.9984 1498.6398 1540.3555 1572.7266 1588.9472 1607.7858 1623.4480 1628.3605 2819.6813 2831.1219 2897.1897 2960.1549 2963.2649 2983.5496 2985.9279 2991.7233 3018.2034 3029.3676 3035.0622 3044.6068 3048.2654 3053.2163 3109.6800 3124.5134 3126.4064 3133.1336 3140.0081 3159.2123 3165.7245 3175.0272 3205.7172 3378.2305 3583.6069
redmass: 5.1211 3.8385 4.4969 4.3668 3.4065 4.1197 3.5996 4.8860 4.2665 4.3605 4.1890 4.1099 3.7313 3.1274 4.2731 1.4817 2.4003 2.2798 3.9859 2.0365 3.0048 3.6940 1.1728 5.3451 5.4808 1.8571 3.8321 5.4527 3.5734 3.2303 3.0846 2.9135 6.2971 4.7564 3.8939 3.5268 3.6597 2.9049 4.2052 3.7318 6.5757 2.3620 5.4202 4.1907 4.1011 3.7788 1.4720 3.0726 1.4833 3.0906 2.0693 1.5533 1.7727 1.6907 1.8431 1.9221 2.2858 5.5662 2.3758 1.3674 1.4830 3.7288 1.7282 1.3185 3.0388 1.3723 1.9665 2.3642 3.7399 2.3982 2.1878 2.4568 1.4022 2.5961 2.2635 1.2614 2.6605 1.7762 1.5017 1.3410 1.7321 1.2710 1.7157 1.8974 1.3051 1.6435 1.9002 1.6696 1.4680 1.2211 1.4388 2.6059 1.5356 1.4293 2.5034 1.3009 1.5292 1.4530 1.9937 1.4710 1.4616 3.0990 1.6401 3.5184 4.2473 1.6353 2.3508 1.7350 1.1254 1.2028 1.1542 2.0514 1.0702 1.0919 1.2869 2.1345 1.3403 1.1002 3.3214 2.5933 5.5247 5.5875 5.5544 6.4576 6.9444 1.0713 1.0700 1.0682 1.0328 1.0625 1.0619 1.0616 1.0887 1.0874 1.0940 1.0894 1.1033 1.1039 1.1035 1.0878 1.0995 1.0870 1.0919 1.0960 1.0912 1.0991 1.0909 1.0906 1.0749 1.0660
irintensity: 0.0518 0.4981 0.3346 2.0539 0.0288 2.2528 1.9481 2.9959 1.4480 0.1696 0.8310 0.8043 2.9937 4.1444 3.4525 0.6628 3.5610 3.3859 1.3934 6.4396 1.1842 9.4378 116.1029 2.4423 2.7154 2.7079 5.9480 10.7325 8.5491 1.9317 3.2050 17.8103 13.6162 4.5127 0.9946 8.6982 8.3446 8.4650 6.4984 6.8678 9.4238 2.1160 13.4173 2.3385 12.2500 16.4016 26.9009 1.8032 5.1363 61.5397 18.6591 42.3970 34.5456 3.0047 3.7733 6.1924 77.0162 2.9992 5.6094 4.3898 2.5084 2.2886 14.8577 3.4199 3.1967 1.3405 13.2960 17.2707 34.5304 11.4679 20.7778 116.0647 7.3158 10.9207 28.7849 0.1003 4.3450 21.9615 30.7752 36.8467 24.2677 73.3405 167.1647 50.9093 2.5866 12.4061 38.1243 10.2832 37.3528 3.8480 51.9750 18.0324 44.0706 2.4759 6.1139 8.0848 16.0454 4.0082 5.6905 1.5128 3.3360 4.2264 0.1220 59.1935 82.7626 30.8543 17.9232 54.6386 9.0259 18.3141 30.0371 64.9836 12.1867 10.3659 3.7047 121.5498 14.4355 13.8579 169.3263 362.3328 334.6481 96.1405 37.9316 91.1631 227.7338 50.6687 194.3844 60.4753 66.0555 49.3943 32.3671 25.8780 10.9605 66.3773 69.3862 18.3694 20.5198 44.2819 106.9275 28.9223 23.4168 2.4989 21.8459 14.9167 8.8243 42.5120 9.1556 1.1460 104.9182 45.5104
temp: 298.150 k
press: 1.00000 atm
elementType: 8 8 7 7 7 6 6 6 6 6 6 6 6 6 6 6 6 6 6 6 6 6 6 6 6 6 6 1 1 1 1 1 1 1 1 1 1 1 1 1 1 1 1 1 1 1 1 1 1 1 1 1
symmnumber: 1
zpe: 1123816.9 jmol-1
zpe.correction: 0.428039 hartree
zpe.thermalcorrener: 0.452125 hartree
zpe.thermalcorrenthalpy: 0.453069 hartree
zpe.thermalcorrgfe: 0.373246 hartree
zpe.sumelectzpe: -1166.073496 hartree
zpe.sumelectthermal: -1166.049411 hartree
zpe.sumelectthermalent: -1166.048467 hartree
zpe.sumelectthermalfe: -1166.128290 hartree
dipole: 1.3329 1.0308 -0.6727
dipole: 1.8143
quadrupole: -138.3816 -129.2175 -164.2401
quadrupole: 11.2117 2.4403 3.3728
quadrupole: 5.5648 14.7289 -20.2937 11.2117 2.4403 3.3728
hfenergy: -1166.5015354 hartree
pointgroup: C01 [X(C22H25N3O2)]
dipole: -0.527747 -0.3937127 -0.2756599 debye
polarizability: 400.6741138|14.3445812|339.0322954|-8.5555595|0.195008|149.90638 unknown
InChI: InChI=1S/C22H25N3O2/c1-27-19-13-16-6-5-9-23-22(16)20(14-19)24-18-7-8-21(26)17(12-18)15-25-10-3-2-4-11-25/h5-9,12-14,24,26H,2-4,10-11,15H2,1H3
charge 0 multiplicity 1
52 atoms
O  4.369105 3.303999 -0.186131
O  -1.180026 -3.077976 -0.591864
N  3.406307 -0.769226 0.548832
N  -1.079008 1.751585 -0.013683
N  -3.714671 1.832375 0.300459
C  3.397489 -1.232036 -0.863785
C  4.215367 -1.663876 1.412567
C  2.835561 -2.66354 -0.980272
C  3.674774 -3.108272 1.368946
C  3.636521 -3.63569 -0.083899
C  3.804212 0.653245 0.668789
C  2.695282 1.614681 0.250649
C  1.342243 1.219965 0.308673
C  3.002081 2.936587 -0.159246
C  0.291077 2.098634 -0.064154
C  1.968723 3.83729 -0.5068
C  0.624421 3.420486 -0.469324
C  -1.7144 0.518822 -0.065882
C  -3.163871 0.581694 0.110449
C  -3.948697 -0.627726 0.067398
C  -1.125139 -0.733304 -0.303963
C  -1.927126 -1.914677 -0.344544
C  -3.31663 -1.891423 -0.154944
C  -5.362541 -0.477163 0.253973
C  -5.912817 0.793265 0.454122
C  -5.049819 1.930876 0.466333
C  -1.907322 -4.346553 -0.662223
H  4.435116 -1.207679 -1.292777
H  2.784336 -0.528439 -1.455809
H  4.177505 -1.275607 2.448142
H  5.293589 -1.669614 1.097727
H  1.771595 -2.666412 -0.673638
H  2.87573 -2.985608 -2.039013
H  4.308203 -3.756911 2.004882
H  2.651293 -3.116619 1.791369
H  3.193947 -4.649515 -0.116409
H  4.674229 -3.721691 -0.469353
H  4.726648 0.889593 0.086634
H  4.058099 0.846137 1.730914
H  1.152659 0.211269 0.682144
H  2.210021 4.862238 -0.818545
H  -0.170333 4.116245 -0.762352
H  -1.767493 2.515294 0.07681
H  4.471084 4.227595 -0.524644
H  -0.058414 -0.852078 -0.492898
H  -3.924456 -2.800215 -0.176168
H  -6.002833 -1.366982 0.234521
H  -6.989388 0.928644 0.597668
H  -5.453763 2.938789 0.613363
H  -2.653274 -4.336183 -1.480584
H  -2.412127 -4.572591 0.297165
H  -1.140467 -5.107903 -0.867328
