program: Gaussian 09
title: 000279566
version: EM64L-G09RevD.01
frameworkgroup: C1[X(C14H11BrO4)]
method: RPBEPBE
basis: SDD
operation: Freq
keyword: #p
keyword: freq=noraman
keyword: PBEPBE/SDD
title: #p freq=noraman PBEPBE/SDD
converged: YES YES NO NO
title: Mulliken charges:
elementType: Br O O O O C C C C C C C C C C C C C C H H H H H H H H H H H
charge: 0.117784 -0.283206 -0.172901 -0.166589 -0.172641 0.340403 0.258817 -0.479048 0.523772 -0.344972 -0.073034 0.081704 -0.706991 -0.361133 -0.355036 0.246193 -0.683586 -0.224406 -0.219719 0.258876 0.251783 0.215044 0.226603 0.290321 0.292856 0.225898 0.211986 0.210703 0.245078 0.245443
chargesum: 0.00000
title: Mulliken charges with hydrogens summed into heavy atoms:
elementType: Br O O O O C C C C C C C C C C C C C C
charge: 0.117784 -0.283206 -0.172901 -0.166589 -0.172641 0.340403 0.258817 0.031611 0.523772 0.096674 -0.073034 0.081704 -0.706991 -0.070812 -0.062181 0.246193 -0.034999 0.020672 0.025724
polarizability: 2.54028313e+02 6.55313798e+00 2.28119067e+02 -1.14093145e+01 4.55251915e+00 9.20537524e+01
1716.lowfreq: -2.6262 -0.0007 -0.0001 0.0007 2.9735 7.9193 25.3097 37.9449 49.2678
frequency: 25.1908 37.9035 49.2576 54.1502 62.1181 95.0589 105.6699 126.5121 141.7839 163.2404 188.0078 224.9989 228.4419 246.7251 280.4155 292.4939 339.6130 347.0609 368.4435 417.1377 427.9968 445.2456 482.2868 510.5190 524.5520 569.4181 642.6394 647.6991 695.3276 701.4774 730.5784 737.8062 777.1101 804.5420 809.5728 846.8647 859.1161 866.3113 897.8721 933.3729 970.8253 996.5100 1014.9350 1018.3151 1034.4402 1059.4615 1080.1336 1101.0824 1114.2065 1118.3902 1170.7458 1176.8155 1220.7692 1237.5795 1275.4414 1284.3819 1290.5994 1296.3599 1362.7744 1395.2653 1402.1598 1434.3336 1440.1746 1471.6877 1474.0066 1478.7810 1486.1734 1544.5699 1556.6216 1574.0640 1600.5862 1607.0041 1709.5343 2976.6685 2987.6300 3003.5584 3035.5157 3054.5003 3079.6293 3080.5163 3141.4331 3154.8851 3164.9027 3175.0413
redmass: 4.9014 5.3436 5.7576 2.0359 6.4705 2.9844 5.4079 6.3458 7.9327 7.3950 6.4709 1.0918 13.9048 5.6873 6.8841 7.5224 6.5949 4.2965 10.7695 4.8049 4.2223 9.6210 8.5750 3.3179 5.0420 8.6237 6.8633 7.1767 6.1202 5.0289 2.4112 1.3068 7.3483 2.9103 2.8743 4.4535 3.4525 1.5208 2.0086 1.7436 8.8979 1.3997 1.3708 3.0455 2.2826 2.9039 3.2786 1.5509 2.7800 2.2658 1.9282 1.4753 1.3267 2.3739 3.0505 1.2149 2.2553 1.4556 1.6641 1.2123 10.1525 1.0817 2.4363 2.6632 1.0525 1.0428 1.0798 10.4059 10.4410 10.8972 8.7946 6.8057 11.0911 1.0363 1.0629 1.0609 1.0968 1.1000 1.1021 1.0988 1.0865 1.0903 1.0949 1.1006
irintensity: 0.7577 2.0193 2.8666 0.9024 0.2886 2.9680 0.5715 0.3196 0.1752 0.9630 0.9095 0.0967 0.7968 5.2359 9.6224 1.3296 2.2046 0.3777 15.5299 0.3747 1.1479 6.8545 5.8955 6.7251 10.0532 6.6464 18.1487 9.5900 2.1069 20.8511 46.2511 13.0821 95.0191 79.2880 107.7274 7.6201 15.1380 14.2987 75.5515 0.7780 244.5994 3.3126 0.7430 427.6904 24.4688 42.7296 2.5865 5.1555 46.7175 77.7602 119.6625 59.9679 0.1858 60.2983 149.5888 19.0550 118.2227 50.4010 31.7075 8.0374 0.0171 35.6122 3.0764 3.3446 4.8179 13.4009 16.0852 5.1528 265.9676 192.4561 38.7758 3.7909 150.8263 37.0150 8.7145 21.3704 0.5479 0.4165 62.9825 44.6086 3.4259 3.3915 0.8211 24.1007
temp: 298.150 k
press: 1.00000 atm
elementType: 35 8 8 8 8 6 6 6 6 6 6 6 6 6 6 6 6 6 6 1 1 1 1 1 1 1 1 1 1 1
symmnumber: 1
zpe: 565579.7 jmol-1
zpe.correction: 0.215418 hartree
zpe.thermalcorrener: 0.233379 hartree
zpe.thermalcorrenthalpy: 0.234323 hartree
zpe.thermalcorrgfe: 0.166694 hartree
zpe.sumelectzpe: -853.086458 hartree
zpe.sumelectthermal: -853.068497 hartree
zpe.sumelectthermalent: -853.067552 hartree
zpe.sumelectthermalfe: -853.135181 hartree
dipole: -0.4039 -2.5537 -1.0891
dipole: 2.8055
quadrupole: -91.0659 -119.5264 -123.8837
quadrupole: 15.3307 -3.2071 0.7108
quadrupole: 20.4261 -8.0344 -12.3917 15.3307 -3.2071 0.7108
hfenergy: -853.3018756 hartree
pointgroup: C01 [X(C14H11Br1O4)]
dipole: 0.210673 1.0354736 -0.3188647 debye
polarizability: 254.8808238|3.9360739|226.9770344|10.0431545|9.6815458|92.3432736 unknown
InChI: InChI=1S/C14H11BrO4/c1-2-5-10(16)19-14-11(15)12(17)8-6-3-4-7-9(8)13(14)18/h3-4,6-7H,2,5H2,1H3
charge 0 multiplicity 1
30 atoms
Br -0.536898 -3.552889 -0.380551
O  -1.75967 -0.677025 -0.510725
O  -0.420577 1.727821 -0.393483
O  2.489719 -2.920551 -0.077243
O  -2.259069 0.306442 1.570207
C  1.74955 0.706227 -0.036285
C  2.494758 -0.504509 0.021476
C  -3.955576 0.29331 -0.246559
C  -0.385845 -0.67035 -0.288045
C  -5.059158 0.72919 0.739058
C  0.276158 0.680191 -0.237592
C  1.827263 -1.842208 -0.107503
C  0.338159 -1.838664 -0.252346
C  2.411721 1.951182 0.085328
C  3.897548 -0.457369 0.198721
C  -2.628146 0.039911 0.421837
C  -6.383125 1.03765 0.010259
C  3.809978 1.991397 0.266387
C  4.552976 0.786284 0.322653
H  -3.783637 1.076213 -1.013204
H  -4.244778 -0.615603 -0.807384
H  -5.21667 -0.068768 1.489271
H  -4.715681 1.617767 1.300011
H  1.814657 2.86712 0.035653
H  4.449318 -1.401662 0.236612
H  -7.165926 1.342291 0.727585
H  -6.257342 1.859572 -0.719378
H  -6.756347 0.152996 -0.539234
H  4.321692 2.95446 0.363058
H  5.638452 0.818972 0.462314
