program: Gaussian 09
title: 000025425
version: EM64L-G09RevD.01
frameworkgroup: C1[X(C8H15NO2)]
method: RPBEPBE
basis: SDD
operation: Freq
keyword: #p
keyword: freq=noraman
keyword: PBEPBE/SDD
title: #p freq=noraman PBEPBE/SDD
converged: YES YES NO NO
title: Mulliken charges:
elementType: O O N C C C C C C C C H H H H H H H H H H H H H H H
charge: -0.174539 -0.182223 -0.417177 -0.337596 -0.352655 -0.356039 -0.582339 -0.694442 0.270095 0.246524 -0.796118 0.181649 0.181755 0.219170 0.219867 0.199115 0.199204 0.236841 0.236010 0.208567 0.208580 0.219016 0.320661 0.240966 0.233674 0.271433
chargesum: 0.00000
title: Mulliken charges with hydrogens summed into heavy atoms:
elementType: O O N C C C C C C C C
charge: -0.174539 -0.182223 -0.096516 0.025807 0.086383 0.042280 -0.109488 -0.058279 0.270095 0.246524 -0.050045
polarizability: 1.34805675e+02 1.64082039e+00 9.81574310e+01 -6.09933650e-03 -5.98640744e-02 7.06682060e+01
1716.lowfreq: -11.5215 -7.2901 -0.0007 0.0005 0.0008 7.3889 26.9335 37.7082 46.5225
frequency: 26.6620 34.0759 43.0823 62.1397 63.9151 103.4900 112.1467 139.9899 155.3617 223.2307 223.4517 250.6187 355.5015 393.2665 437.7588 531.2265 536.8333 593.7514 674.2200 705.3530 726.1151 757.8173 846.8306 872.6024 884.3358 905.1260 959.3933 998.1654 1016.8939 1032.1763 1071.1242 1075.7124 1103.8277 1110.8054 1137.5516 1198.2540 1202.3185 1243.9709 1259.9400 1288.4562 1297.0262 1304.1995 1349.7412 1360.7732 1372.9705 1389.4733 1416.5182 1441.2648 1457.8881 1465.2561 1467.2949 1470.6469 1476.5880 1479.5430 1489.3068 1653.2833 1687.1611 2951.1649 2956.7472 2972.9008 2973.7039 2987.1572 2993.3081 3001.0850 3004.5392 3026.5153 3063.2043 3070.4480 3073.1341 3073.8650 3136.7049 3508.8687
redmass: 1.3812 1.9390 2.5049 4.0398 3.8786 2.0170 2.1897 2.5878 4.1625 1.1321 4.4609 5.3740 3.8713 3.1532 4.1546 2.6222 3.8722 2.6827 1.1265 5.0797 1.0815 1.1961 1.3267 3.7516 3.4363 2.0483 1.2637 2.3907 3.6657 1.7178 2.7964 2.1606 1.4482 2.3919 2.8760 1.5637 2.9606 1.3865 1.2502 1.0440 1.1198 1.4482 1.5469 1.6779 1.2342 1.2180 1.6224 1.0931 1.1404 1.0723 1.0495 1.0690 1.0424 1.0684 1.0912 4.7027 10.1217 1.0589 1.0589 1.0430 1.0526 1.0381 1.0987 1.0603 1.0989 1.1028 1.1032 1.1013 1.0982 1.0991 1.0982 1.0768
irintensity: 0.1466 0.0260 3.7209 3.5621 0.1546 0.5493 0.0252 0.1768 0.7456 0.0054 2.0636 1.0367 1.1879 0.4956 11.4077 0.8025 9.7653 2.7090 81.0425 0.2970 16.9470 0.4130 7.0414 2.9219 1.2033 21.1107 0.0923 5.8555 10.1338 9.8258 3.5912 7.3878 0.6455 10.5459 155.8875 0.2118 179.5966 24.6113 0.0015 0.0507 0.6645 14.4596 2.8642 4.8323 68.8208 10.6515 525.5766 56.6117 92.3277 2.3442 22.9269 0.5842 12.8544 3.9614 20.4824 6.3163 255.0743 12.4651 28.4881 67.6376 16.6515 6.6777 8.1793 27.9400 8.5023 16.1727 10.1064 126.3023 17.1915 51.4264 8.3740 8.3337
temp: 298.150 k
press: 1.00000 atm
elementType: 8 8 7 6 6 6 6 6 6 6 6 1 1 1 1 1 1 1 1 1 1 1 1 1 1 1
symmnumber: 1
zpe: 578572.5 jmol-1
zpe.correction: 0.220367 hartree
zpe.thermalcorrener: 0.234319 hartree
zpe.thermalcorrenthalpy: 0.235264 hartree
zpe.thermalcorrgfe: 0.176893 hartree
zpe.sumelectzpe: -518.181378 hartree
zpe.sumelectthermal: -518.167425 hartree
zpe.sumelectthermalent: -518.166481 hartree
zpe.sumelectthermalfe: -518.224851 hartree
dipole: 1.4529 -6.3883 0.0127
dipole: 6.5515
quadrupole: -69.1540 -72.3924 -66.2391
quadrupole: 16.8481 -0.0823 -0.0238
quadrupole: 0.1078 -3.1306 3.0228 16.8481 -0.0823 -0.0238
hfenergy: -518.4017449 hartree
pointgroup: C01 [X(C8H15N1O2)]
dipole: -0.5949269 2.5074671 0.0490926 debye
dipolederiv: -0.6325301 -0.0021502 0.0009338 -0.317988 -0.8166896 -0.005047 -0.0013657 -0.0059826 -0.2830145 -0.7518255 0.081453 0.0034922 0.4169214 -0.7341448 -0.0116088 0.0064673 -0.0101784 -0.3011679 -2.2473481 -0.2694638 0.00313 -0.2650931 -0.468302 0.0017589 0.0044473 -0.0015434 -0.3653105 -0.0447486 -0.0066992 0.0004171 -0.0564773 0.0844718 -0.0023093 -0.0005041 -0.0024776 0.1976921 0.0273728 0.0045888 0.0005907 0.0133969 0.0581924 -0.0015528 -0.0002049 -0.000966 0.1473532 0.0360068 0.0110496 0.0005128 0.0620816 0.0983285 -0.0015203 0.0016708 -0.0013449 0.1689882 -0.361588 0.0753413 0.0031662 0.29352 -0.097324 -0.0064593 0.0101813 -0.0065683 0.1687717 -0.0821339 0.0408253 0.0012988 0.0028402 0.0530637 -0.0009203 0.0005507 -0.0010497 0.0982614 1.7670939 0.1800494 -0.0067551 0.628378 1.1170834 0.0075595 -0.0051397 0.010045 0.1918291 2.0040516 0.0538711 -0.0023989 -0.4582627 1.0109623 0.0230415 -0.0025408 0.0253411 0.2008853 -0.2698716 -0.1784904 -0.0003986 -0.2703945 -0.2935272 -0.0168037 -0.0170852 -0.0297126 0.0512851 0.0334746 -0.0088285 -0.0055993 0.0027957 -0.0434681 -0.1192181 -0.001323 -0.1410907 -0.1015438 0.0333594 -0.0081543 0.0045029 0.0036764 -0.0542682 0.1210566 0.0005575 0.1430827 -0.0907073 0.0521898 -0.00435 -0.0063005 -0.0134568 -0.001983 -0.0958577 0.0106138 -0.1008877 -0.0655255 0.0536248 -0.0041281 0.0055945 -0.0127924 -0.0101773 0.0978157 -0.0116175 0.1026003 -0.0558071 0.0288771 0.0240861 0.0266863 -0.0025052 -0.0348694 -0.1186421 0.0047499 -0.1455909 -0.0918989 0.0286325 0.0259069 -0.0262739 -0.0016898 -0.0455879 0.1204769 -0.0054459 0.1472483 -0.0808812 0.0306334 0.0022069 -0.0170393 -0.041434 0.0028437 -0.0948126 -0.0334185 -0.1150477 -0.0451832 0.0300864 0.00127 0.0175514 -0.0435379 -0.0075078 0.0975923 0.030818 0.11765 -0.0361631 0.0789846 0.0012329 0.0201638 0.0528287 -0.0230818 0.1250603 -0.0279543 0.1398748 -0.0853996 0.079003 0.0014076 -0.0209514 0.0510548 -0.0123492 -0.1223295 0.029225 -0.1368868 -0.0961561 -0.1732718 -0.0996166 -0.0013431 -0.1369973 0.0017215 -0.0016848 -0.0021173 -0.0017805 0.10077 0.1863629 0.027636 0.0012546 0.0246111 0.073613 -0.0027814 0.000695 -0.0013 0.2980711 0.0897425 0.0046458 0.0621789 -0.0110217 0.0476183 -0.076518 0.0237081 -0.0978421 -0.0454573 0.0746298 0.030154 -0.0781549 0.0058299 0.0152441 0.0912916 -0.0349637 0.1143103 -0.0105122 -0.0708082 0.0161561 0.0137409 0.0737162 0.0801377 -0.0075877 0.0199961 0.0000972 0.1308211 unknown
polarizability: 134.771466|1.9841887|98.1814337|-0.1533197|0.5184269|70.6784127 unknown
InChI: InChI=1S/C8H15NO2/c1-3-4-5-6-8(11)9-7(2)10/h9H,3-6H2,1-2H3
charge 0 multiplicity 1
26 atoms
O  0.883813 -1.540843 -0.027831
O  3.764241 -1.049109 -0.043475
N  2.010392 0.53477 -0.010747
C  -3.01603 0.484887 0.009738
C  -1.716291 -0.348571 -0.011486
C  -4.29023 -0.390488 -0.004581
C  -0.452568 0.53168 0.005928
C  -5.590992 0.440623 0.015685
C  0.847211 -0.290301 -0.013214
C  3.379246 0.141161 -0.021375
C  4.333912 1.337837 0.004851
H  -3.031229 1.132502 0.912031
H  -3.036486 1.169107 -0.864997
H  -1.695943 -0.995335 -0.9090
H  -1.692047 -1.034864 0.855954
H  -4.275995 -1.037958 -0.90461
H  -4.271332 -1.073718 0.868477
H  -0.454513 1.177817 0.909173
H  -0.457203 1.218594 -0.866559
H  -5.648407 1.10974 -0.863699
H  -5.643947 1.073182 0.922007
H  -6.485721 -0.20824 0.004626
H  1.836884 1.544246 0.003324
H  4.237704 1.897168 0.954277
H  4.131419 2.036987 -0.827609
H  5.365513 0.968427 -0.082689
