program: Gaussian 09
title: 000279558
version: EM64L-G09RevD.01
frameworkgroup: C1[X(C14H13NO3)]
method: RPBEPBE
basis: SDD
operation: Freq
keyword: #p
keyword: freq=noraman
keyword: PBEPBE/SDD
title: #p freq=noraman PBEPBE/SDD
converged: YES YES NO NO
title: Mulliken charges:
elementType: O O O N C C C C C C C C C C C C C C H H H H H H H H H H H H H
charge: -0.222054 -0.201474 -0.226172 -0.437255 0.345285 0.361362 0.265008 -0.534148 -0.203580 -0.334676 -0.483739 0.010789 0.211780 -0.363502 -0.365554 -0.685213 -0.229362 -0.220494 0.236697 0.236384 0.222510 0.223056 0.354035 0.334204 0.286920 0.293529 0.226169 0.207306 0.207276 0.242421 0.242490
chargesum: 0.00000
title: Mulliken charges with hydrogens summed into heavy atoms:
elementType: O O O N C C C C C C C C C C C C C C
charge: -0.222054 -0.201474 -0.226172 -0.083220 0.345285 0.361362 0.265008 -0.061066 -0.203580 0.110890 -0.149535 0.010789 0.211780 -0.076582 -0.072025 -0.044462 0.013059 0.021996
polarizability: 2.75075724e+02 9.56255451e+00 1.86166271e+02 3.53219564e-01 5.99425613e-02 7.82092354e+01
1716.lowfreq: -5.6842 0.0002 0.0008 0.0008 5.4836 8.5627 21.3758 39.3092 56.5814
frequency: 11.2442 39.2795 56.5127 67.9706 98.0500 116.9167 129.3204 176.0251 181.8014 216.8587 222.9455 227.7605 262.5900 314.7241 352.3254 373.2667 398.2055 441.3906 452.3264 453.2965 497.8866 544.7113 565.7662 622.2390 655.5228 672.9017 700.1485 731.3327 732.8155 740.9237 795.9426 805.2137 814.9380 841.0300 873.4599 902.7765 920.9311 926.9249 944.9693 985.6529 996.2524 1015.3436 1030.4397 1053.7972 1073.7992 1095.4994 1102.9170 1118.8627 1159.0450 1173.1494 1213.0057 1221.5031 1234.5763 1265.1475 1287.5984 1289.3473 1313.8003 1326.0499 1359.3711 1395.3856 1400.1298 1439.5696 1443.1244 1469.6352 1471.7132 1479.5667 1485.1926 1487.1033 1529.6851 1548.8989 1585.2615 1607.8811 1619.9974 1637.5454 2962.5262 2975.1284 3009.5824 3009.9239 3051.2786 3079.2628 3080.6050 3138.6890 3152.7309 3163.1059 3173.0472 3195.6069 3400.1330
redmass: 2.0057 3.8912 4.6407 4.5388 3.4168 6.4654 4.9023 4.6194 5.6884 5.6260 1.2343 3.1242 6.0065 8.4860 3.5144 10.3318 3.6005 4.5268 11.7416 7.1958 3.7950 7.4155 2.6188 6.0219 6.8845 3.7331 6.7638 2.8837 5.4941 1.2256 1.5667 4.4678 1.1675 3.0217 1.3569 2.0249 1.3868 5.4945 1.6798 4.7176 1.3952 1.3653 2.2906 2.4293 3.0027 1.5436 2.4704 1.9121 2.2549 1.0769 2.2615 1.3349 1.9988 1.6045 1.5806 1.0856 4.1035 2.8159 1.7619 1.2154 9.5251 1.1294 2.4710 2.8296 1.0612 1.0419 1.0913 2.2424 8.1365 8.1585 7.1381 6.6930 4.9548 8.4105 1.0595 1.0364 1.0982 1.0615 1.1003 1.0986 1.1026 1.0864 1.0902 1.0948 1.1005 1.0930 1.0757
irintensity: 0.0007 1.3006 0.0012 0.6380 7.2297 5.9301 0.8386 4.5233 0.1254 2.2815 0.2772 0.4571 3.3806 8.9523 0.0741 25.0248 1.2093 0.8404 5.1041 0.8921 0.1727 24.5067 0.9462 1.1861 1.4614 4.5619 1.4333 44.1623 0.4852 2.6157 54.1814 1.6957 79.1947 5.6859 0.4126 21.2756 9.8238 23.7383 27.7909 8.5723 2.8765 0.1527 11.4518 9.3979 0.4092 1.5065 35.8734 18.3428 109.4784 13.5940 72.0757 0.0889 53.3657 2.1668 19.8232 0.1257 403.8951 140.6105 36.9720 8.6201 1.3830 21.9766 13.8062 2.3570 29.5383 13.4938 35.6176 866.0687 52.6703 210.8301 44.2053 3.4844 112.0919 108.2151 18.2684 38.3945 8.1475 15.8280 1.4752 46.2293 72.6807 3.6729 4.5160 1.4967 25.7845 6.9411 70.4616
temp: 298.150 k
press: 1.00000 atm
elementType: 8 8 8 7 6 6 6 6 6 6 6 6 6 6 6 6 6 6 1 1 1 1 1 1 1 1 1 1 1 1 1
symmnumber: 1
zpe: 629180.2 jmol-1
zpe.correction: 0.239642 hartree
zpe.thermalcorrener: 0.255899 hartree
zpe.thermalcorrenthalpy: 0.256843 hartree
zpe.thermalcorrgfe: 0.193595 hartree
zpe.sumelectzpe: -820.457687 hartree
zpe.sumelectthermal: -820.441431 hartree
zpe.sumelectthermalent: -820.440486 hartree
zpe.sumelectthermalfe: -820.503735 hartree
dipole: 0.5354 -4.4456 0.0186
dipole: 4.4778
quadrupole: -77.5300 -119.7085 -105.7475
quadrupole: -0.2758 0.0883 -0.0159
quadrupole: 23.4654 -18.7132 -4.7522 -0.2758 0.0883 -0.0159
hfenergy: -820.6973292 hartree
pointgroup: C01 [X(C14H13N1O3)]
dipole: -0.2345691 1.7417193 0.1223724 debye
polarizability: 274.7963171|10.7059275|185.9652985|1.3738991|7.1828928|78.6896146 unknown
InChI: InChI=1S/C14H13NO3/c1-2-5-13(17)15-11-8-12(16)9-6-3-4-7-10(9)14(11)18/h3-4,6-8,15H,2,5H2,1H3
charge 0 multiplicity 1
31 atoms
O  -0.200728 2.27567 0.122434
O  -1.756492 -2.97161 -0.227539
O  2.935989 -1.540462 -0.106951
N  1.705097 0.444663 0.012289
C  -2.050935 0.710028 0.017485
C  0.399012 -0.045256 -0.026606
C  -2.442846 -0.657235 -0.07283
C  4.159818 0.601407 0.043775
C  -0.615044 1.071178 0.043047
C  5.471059 -0.207955 0.010939
C  0.011142 -1.368439 -0.115389
C  -1.407773 -1.746547 -0.144285
C  2.910439 -0.281653 -0.024833
C  -3.03456 1.72845 0.084837
C  -3.815558 -0.989546 -0.094838
C  6.713294 0.704531 0.074783
C  -4.402358 1.387794 0.062756
C  -4.792537 0.02807 -0.027224
H  4.136036 1.320542 -0.80156
H  4.114791 1.214337 0.968243
H  5.476275 -0.922756 0.854191
H  5.49346 -0.823153 -0.907279
H  1.743403 1.473809 0.079827
H  0.751377 -2.169312 -0.165712
H  -2.706528 2.770419 0.154232
H  -4.090181 -2.046749 -0.164984
H  7.642713 0.107994 0.048829
H  6.72562 1.304666 1.004436
H  6.74137 1.407069 -0.779672
H  -5.163382 2.173217 0.11529
H  -5.855772 -0.234171 -0.044396
