program: Gaussian 09
title: 000279571
version: EM64L-G09RevD.01
frameworkgroup: C1[X(C18H11ClFNO3)]
method: RPBEPBE
basis: SDD
operation: Freq
keyword: #p
keyword: freq=noraman
keyword: PBEPBE/SDD
title: #p freq=noraman PBEPBE/SDD
converged: YES YES NO NO
title: Mulliken charges:
elementType: Cl F O O O N C C C C C C C C C C C C C C C C C C H H H H H H H H H H H
charge: 0.080268 -0.201455 -0.162755 -0.160862 -0.219597 -0.306339 0.480056 0.319198 0.278141 -0.094218 -0.623450 0.446954 0.000334 -0.370937 -0.359809 0.214946 -0.301473 -0.297166 -0.224365 -0.222300 -0.778777 -0.365855 -0.366011 0.329811 0.293128 0.295480 0.252189 0.270351 0.246894 0.247382 0.238234 0.278977 0.264052 0.258721 0.260252
chargesum: 0.00000
title: Mulliken charges with hydrogens summed into heavy atoms:
elementType: Cl F O O O N C C C C C C C C C C C C C C C C C C
charge: 0.080268 -0.201455 -0.162755 -0.160862 -0.219597 -0.306339 0.480056 0.319198 0.278141 -0.094218 -0.623450 0.446954 0.000334 -0.077809 -0.064329 0.214946 -0.049285 -0.026815 0.022530 0.025081 0.002486 -0.107134 -0.105759 0.329811
polarizability: 3.56995029e+02 -1.98659685e+01 2.14332095e+02 -1.90236880e+01 -1.70023357e+01 1.74944817e+02
1716.lowfreq: -9.8006 -4.8677 -0.0014 -0.0006 0.0009 4.5993 20.9968 33.4126 42.1445
frequency: 20.8988 33.3917 42.0964 55.7615 63.1960 82.0573 91.4330 109.4548 122.2229 150.5704 163.3363 181.8816 200.9415 225.7550 261.4152 288.6632 305.2461 327.0210 351.9698 362.1952 370.0927 389.9784 412.0895 420.1383 427.9792 450.5464 467.0848 492.3267 508.5304 527.8907 566.6938 584.5842 604.2171 627.2687 630.4700 691.1664 695.3827 707.6498 723.8005 744.6471 795.3389 804.0745 807.8724 825.2186 828.0782 842.7771 848.5678 907.5282 932.6294 934.6031 949.8694 997.4449 998.8276 1006.4739 1010.5204 1017.1214 1037.3330 1047.3659 1081.6349 1109.3132 1117.8104 1156.9175 1174.0867 1177.4302 1203.0886 1231.0408 1236.6495 1272.3667 1283.1816 1294.6410 1301.8579 1379.0494 1381.0838 1401.7477 1412.3164 1440.8388 1454.3458 1459.7597 1470.0750 1490.2676 1534.3028 1550.1663 1554.4124 1595.3477 1599.9058 1605.6298 1607.1396 1620.2337 3003.6232 3099.0447 3123.1640 3142.7160 3155.8745 3155.9652 3165.5652 3173.1833 3175.8376 3181.6565 3197.5403
redmass: 8.5539 6.8677 4.5030 7.9271 12.7645 5.8568 4.4290 1.3173 4.5944 4.4613 5.5735 6.4317 8.6869 8.9803 6.7944 8.6090 9.6691 7.6834 6.4749 6.2540 10.9812 6.2527 2.9659 4.5464 4.4637 5.3774 11.0598 4.8757 3.3251 5.9732 5.8183 4.1640 4.4906 7.1186 6.6226 5.5575 5.9994 4.3482 2.9774 5.6202 3.5483 1.3790 1.8784 3.1901 2.5810 3.8995 7.1194 4.2487 1.6228 1.4493 1.3638 2.0074 1.5197 2.0996 5.1373 1.3698 1.6471 2.4964 3.1564 1.4685 2.1670 1.4405 1.2257 2.0889 2.3926 4.3336 2.5174 4.7914 2.3090 1.3844 5.2903 2.6930 1.6994 10.2550 3.7325 2.4440 1.0721 1.0699 2.6202 2.6057 10.1093 10.2392 11.3823 8.1220 7.9340 6.7100 6.8617 9.0329 1.0360 1.0986 1.0998 1.0866 1.0903 1.0894 1.0949 1.0902 1.1007 1.0967 1.0969
irintensity: 1.2791 0.4101 0.0196 1.2282 2.1748 1.2634 2.5417 0.7262 0.8782 2.4722 3.9539 0.1322 2.1261 1.0833 0.9149 1.4954 1.3125 0.0668 3.2615 5.8407 21.0887 2.4888 0.1074 1.7408 4.1516 5.6685 3.8375 13.6223 18.4936 4.6243 14.6897 4.5693 28.3411 2.3988 8.5270 1.6113 2.7443 1.4758 83.6565 5.4846 15.2956 6.5661 40.7105 92.9635 19.4308 7.2992 0.7876 8.7180 1.6218 10.3027 6.0711 32.8820 7.7384 29.0858 29.6971 0.0274 11.5838 6.7203 10.1779 30.7825 87.7111 84.2091 17.6194 8.6894 83.4330 407.6047 103.6768 195.5886 65.2547 5.5774 127.8371 15.1652 35.1573 2.3693 3.7210 2.1625 30.0863 20.4048 11.9159 153.1690 83.8975 256.4031 273.9124 55.1934 5.2255 4.5918 47.4709 72.9963 3.8035 6.7160 9.5263 3.5204 3.8653 4.0221 0.6190 4.2253 25.1379 2.0714 0.1471
temp: 298.150 k
press: 1.00000 atm
elementType: 17 9 8 8 8 7 6 6 6 6 6 6 6 6 6 6 6 6 6 6 6 6 6 6 1 1 1 1 1 1 1 1 1 1 1
symmnumber: 1
zpe: 639072.0 jmol-1
zpe.correction: 0.243410 hartree
zpe.thermalcorrener: 0.264052 hartree
zpe.thermalcorrenthalpy: 0.264996 hartree
zpe.thermalcorrgfe: 0.192175 hartree
zpe.sumelectzpe: -1531.182458 hartree
zpe.sumelectthermal: -1531.161816 hartree
zpe.sumelectthermalent: -1531.160871 hartree
zpe.sumelectthermalfe: -1531.233692 hartree
dipole: 6.0198 0.1069 -0.6683
dipole: 6.0578
quadrupole: -129.7963 -158.4068 -141.2040
quadrupole: 6.4936 -14.2542 8.2031
quadrupole: 13.3394 -15.2711 1.9317 6.4936 -14.2542 8.2031
hfenergy: -1531.4258676 hartree
pointgroup: C01 [X(C18H11Cl1F1N1O3)]
dipole: 2.3521898 -0.220113 -0.3144696 debye
polarizability: 357.2308316|-27.544845|170.0264726|-0.6627057|-6.002728|219.0146366 unknown
InChI: InChI=1S/C18H11ClFNO3/c1-10(22)21(12-8-6-11(20)7-9-12)16-15(19)17(23)13-4-2-3-5-14(13)18(16)24/h2-9H,1H3
charge 0 multiplicity 1
35 atoms
Cl -0.510326 1.191816 2.503692
F  -5.393483 -2.325786 1.16626
O  0.787585 -0.090918 -2.336255
O  2.261504 0.180884 2.949899
O  -2.446084 2.207781 -1.919595
N  -1.087628 0.914355 -0.522482
C  0.218305 0.542842 -0.087612
C  2.541124 -0.376032 -0.696868
C  2.909387 -0.333039 0.676452
C  1.173468 0.022513 -1.132126
C  0.604268 0.5735 1.239849
C  -2.203955 0.096847 -0.085726
C  1.946666 0.133667 1.722337
C  3.476799 -0.814897 -1.664995
C  4.208558 -0.733032 1.070186
C  -1.298656 1.979418 -1.457514
C  -2.070107 -1.313296 -0.101755
C  -3.415182 0.692739 0.343928
C  4.770951 -1.209511 -1.26747
C  5.136691 -1.168683 0.10135
C  -0.096871 2.839127 -1.813226
C  -3.133621 -2.13398 0.326379
C  -4.49076 -0.118094 0.756832
C  -4.322895 -1.514055 0.745217
H  3.168136 -0.842826 -2.714628
H  4.465919 -0.692428 2.132996
H  -1.14783 -1.771987 -0.470822
H  -3.518474 1.779218 0.348793
H  5.49326 -1.550074 -2.016375
H  6.141555 -1.476815 0.408021
H  0.656369 2.887764 -1.00906
H  0.383839 2.436414 -2.721508
H  -0.459421 3.853927 -2.038471
H  -3.053867 -3.224389 0.320343
H  -5.437324 0.316935 1.08885
