program: Gaussian 09
title: 000279544
version: EM64L-G09RevD.01
frameworkgroup: C1[X(C12H13NO2S)]
method: RPBEPBE
basis: SDD
operation: Freq
keyword: #p
keyword: freq=noraman
keyword: PBEPBE/SDD
title: #p freq=noraman PBEPBE/SDD
converged: YES YES NO NO
title: Mulliken charges:
elementType: S O O N C C C C C C C C C C C C H H H H H H H H H H H H H
charge: 0.956357 -0.556236 -0.561099 0.002896 -0.065944 -0.649510 -0.427218 -0.589224 -0.296623 0.510129 -0.215040 -0.380851 -0.436561 -0.227820 -0.224763 -0.233884 0.273167 0.300619 0.284165 0.278049 0.236585 0.287816 0.281260 0.262871 0.245347 0.237580 0.234418 0.235668 0.237845
chargesum: 0.00000
title: Mulliken charges with hydrogens summed into heavy atoms:
elementType: S O O N C C C C C C C C C C C C
charge: 0.956357 -0.556236 -0.561099 0.002896 0.207224 -0.064726 0.087416 -0.020148 -0.033752 0.510129 -0.215040 -0.135503 -0.198981 0.006598 0.010905 0.003961
polarizability: 1.73915026e+02 1.34875321e+01 1.61378158e+02 -1.06216001e+01 8.79113848e+00 1.36245092e+02
1716.lowfreq: -14.0169 -3.4838 0.0011 0.0014 0.0018 2.7976 27.7193 38.5706 45.4405
frequency: 27.3986 38.3931 45.2479 54.8596 106.0167 110.3161 153.0989 178.4525 213.3895 247.1673 262.0063 274.2494 298.5807 327.1077 377.6596 402.7082 406.0017 427.8954 460.5451 517.7192 537.4672 573.8147 614.1502 632.8117 634.4094 706.1073 762.4979 784.9371 807.9311 819.1557 838.2619 854.8200 867.5307 922.1058 933.2059 953.9767 969.6730 979.9108 991.5168 1001.7007 1007.1162 1028.2802 1040.7111 1078.8576 1085.1283 1091.2447 1135.6632 1173.9994 1176.8103 1187.0696 1192.5809 1196.5426 1231.5574 1253.2823 1269.4681 1304.2384 1332.9800 1337.5107 1344.3218 1384.1082 1416.6132 1423.1786 1444.5039 1453.9136 1482.2676 1596.4659 1611.6489 2190.5574 2983.6066 2999.5147 3015.5578 3059.4549 3059.7994 3071.6480 3119.0736 3124.6946 3139.9664 3152.7513 3162.0627 3164.6710 3169.7897
redmass: 6.8072 4.3434 4.2141 6.2397 5.5444 5.6407 4.1368 6.6611 3.3955 6.8706 3.0339 5.3947 5.2249 5.1511 4.5145 2.8060 2.7539 8.1218 6.2415 3.9776 4.6542 5.8555 6.3523 6.3835 3.3477 1.7743 1.7625 1.9784 6.0475 4.4320 1.9319 1.2492 2.4333 1.5627 2.6875 1.7935 2.5513 1.3950 6.0456 1.3867 2.5985 2.1669 2.5817 1.4271 1.5290 2.4196 1.4128 1.4637 1.0596 1.3639 1.1130 1.7620 1.4619 1.2438 1.5595 1.2436 1.3135 1.3104 1.2377 7.7594 1.1073 1.1000 2.1586 1.0924 2.2513 6.1280 6.0472 12.5817 1.0818 1.0632 1.0829 1.0585 1.0641 1.0938 1.0888 1.0879 1.0901 1.0955 1.1116 1.1103 1.1014
irintensity: 10.0498 0.4482 0.4650 1.8945 4.9606 2.0190 0.3753 1.6461 0.1451 6.5673 1.5714 14.0591 9.7331 3.9465 17.0711 1.3460 5.3143 1.5733 6.5860 5.7523 9.3473 11.5992 1.8729 6.4585 35.5010 54.2865 36.6268 23.0529 80.1792 1.5272 10.5216 0.0193 11.7043 7.5893 66.5347 2.2799 6.4329 0.0517 2.3560 0.5216 2.7422 4.5682 0.3216 3.8091 15.9671 4.5732 5.3100 1.0262 0.1583 7.3701 0.3882 4.8221 2.7266 12.1978 2.2930 1.7545 6.5410 1.0639 1.7134 0.1371 14.1297 7.7933 11.3096 8.0406 15.4724 1.5928 3.5532 6.8709 3.0964 6.9346 13.5483 1.5560 2.1253 8.0343 8.2486 4.9743 5.8300 23.7661 0.6082 0.3027 17.8179
temp: 298.150 k
press: 1.00000 atm
elementType: 16 8 8 7 6 6 6 6 6 6 6 6 6 6 6 6 1 1 1 1 1 1 1 1 1 1 1 1 1
symmnumber: 1
zpe: 585021.8 jmol-1
zpe.correction: 0.222823 hartree
zpe.thermalcorrener: 0.238343 hartree
zpe.thermalcorrenthalpy: 0.239287 hartree
zpe.thermalcorrgfe: 0.178175 hartree
zpe.sumelectzpe: -1066.988374 hartree
zpe.sumelectthermal: -1066.972855 hartree
zpe.sumelectthermalent: -1066.971911 hartree
zpe.sumelectthermalfe: -1067.033022 hartree
dipole: -4.0819 0.8772 -0.5589
dipole: 4.2123
quadrupole: -115.7337 -119.4062 -101.0592
quadrupole: 30.2657 -0.3685 2.9897
quadrupole: -3.6673 -7.3398 11.0072 30.2657 -0.3685 2.9897
hfenergy: -1067.2111975 hartree
pointgroup: C01 [X(C12H13N1O2S1)]
dipole: -1.5975614 -0.435142 -0.070421 debye
polarizability: 172.9368235|-16.9473055|153.8370992|9.5124244|12.4698141|144.7643534 unknown
InChI: InChI=1S/C12H13NO2S/c13-8-12(10-4-2-1-3-5-10)11-6-7-16(14,15)9-11/h1-5,11-12H,6-7,9H2
charge 0 multiplicity 1
29 atoms
S  3.164865 1.008838 0.523558
O  3.546907 2.188059 -0.541676
O  3.757508 1.00689 2.048863
N  -0.811809 -3.393797 -1.143597
C  0.935588 -0.495779 -0.19015
C  1.217593 0.779034 0.615855
C  2.128945 -1.487634 -0.000124
C  3.439756 -0.755699 -0.286304
C  -0.434957 -1.137561 0.238369
C  -1.608793 -0.159802 0.071429
C  -0.655482 -2.38817 -0.520978
C  -2.124807 0.140141 -1.213638
C  -2.151383 0.489129 1.206364
C  -3.164646 1.083664 -1.36012
C  -3.192108 1.434068 1.060148
C  -3.699049 1.735741 -0.224175
H  0.863836 -0.234876 -1.264033
H  0.801992 1.702905 0.193697
H  1.018088 0.68564 1.694522
H  2.013947 -2.350082 -0.680681
H  2.131157 -1.875138 1.037002
H  4.331075 -1.158574 0.213562
H  3.618512 -0.536645 -1.349983
H  -0.353521 -1.418165 1.308756
H  -1.729164 -0.375171 -2.097454
H  -1.769134 0.252386 2.207142
H  -3.56116 1.306206 -2.356559
H  -3.606856 1.928801 1.944877
H  -4.506998 2.466287 -0.338771
