program: Gaussian 09
title: 000279499
version: EM64L-G09RevD.01
frameworkgroup: C1[X(C6H13BrO2)]
method: RPBEPBE
basis: SDD
operation: Freq
keyword: #p
keyword: freq=noraman
keyword: PBEPBE/SDD
title: #p freq=noraman PBEPBE/SDD
converged: YES YES NO NO
title: Mulliken charges:
elementType: Br O O C C C C C C H H H H H H H H H H H H H
charge: -0.038040 -0.451985 -0.441449 0.338713 -0.404362 -0.443716 -0.380075 -0.782526 -0.704239 0.174149 0.245052 0.217311 0.248573 0.238410 0.194736 0.311403 0.283885 0.224974 0.205349 0.246307 0.347157 0.370374
chargesum: 0.00000
title: Mulliken charges with hydrogens summed into heavy atoms:
elementType: Br O O C C C C C C
charge: -0.038040 -0.104827 -0.071076 0.338713 0.014839 0.022168 0.053070 -0.187238 -0.027610
polarizability: 1.07831184e+02 -1.35821103e+00 7.98614203e+01 -6.23217865e+00 -1.15194301e+00 7.26576078e+01
1716.lowfreq: -21.0065 -10.7218 -0.0005 0.0001 0.0003 16.5831 74.1516 96.8163 112.5692
frequency: 74.1454 96.7237 112.5501 130.8701 151.6370 185.5085 240.4728 257.6960 269.0255 294.8233 321.1240 348.8476 386.1791 485.0249 567.5240 620.4042 621.7255 741.5670 768.0032 842.0076 874.9535 915.1590 954.3940 973.9769 996.0831 1011.8458 1034.8059 1077.6905 1119.1060 1148.7348 1193.3575 1208.6334 1246.6825 1263.7623 1295.5286 1312.0396 1342.7074 1353.1746 1375.9996 1381.1154 1396.6414 1435.9470 1458.6341 1466.6030 1468.5735 1482.5091 1490.3529 2946.4897 2970.7297 2980.6571 2998.5675 3021.4753 3044.2913 3071.4786 3079.1966 3081.8550 3087.2103 3127.2447 3499.0761 3575.0545
redmass: 5.2394 3.1688 5.2947 3.0042 1.9186 3.1770 1.5899 2.3613 2.7582 1.5401 2.4129 1.7684 3.9816 2.3943 2.9090 2.1524 1.5608 3.0318 1.2538 2.1125 1.6948 1.7096 3.6971 3.2872 1.9773 1.5982 2.1495 1.9005 1.3902 1.3401 1.4309 1.9842 1.4024 1.3880 1.3079 1.3066 1.5233 1.2547 1.1946 1.1934 1.2061 1.0941 1.0756 1.0708 1.0708 1.0529 1.0471 1.0668 1.0668 1.0372 1.0637 1.0924 1.0563 1.0984 1.0972 1.1000 1.0999 1.1104 1.0653 1.0662
irintensity: 3.4015 0.4274 5.2859 7.0721 1.0845 3.6058 2.1234 3.7662 6.9268 54.3949 0.9524 90.9522 3.0380 4.3545 16.9341 103.5900 110.8668 0.2106 22.8216 18.2653 7.4744 18.2076 60.7645 96.2827 25.5108 5.1674 27.5332 4.6576 41.0075 13.3593 16.5610 5.2537 6.6954 31.9349 13.9717 13.9193 0.2585 19.6880 21.2082 8.6920 18.3743 13.0728 3.0441 4.3665 18.0875 8.3567 12.4742 33.7446 75.5746 21.2408 45.1631 9.3499 16.4898 43.5478 10.4401 31.9897 18.1407 3.7306 26.6179 9.1232
temp: 298.150 k
press: 1.00000 atm
elementType: 35 8 8 6 6 6 6 6 6 1 1 1 1 1 1 1 1 1 1 1 1 1
symmnumber: 1
zpe: 486151.6 jmol-1
zpe.correction: 0.185165 hartree
zpe.thermalcorrener: 0.196572 hartree
zpe.thermalcorrenthalpy: 0.197517 hartree
zpe.thermalcorrgfe: 0.147549 hartree
zpe.sumelectzpe: -399.562930 hartree
zpe.sumelectthermal: -399.551523 hartree
zpe.sumelectthermalent: -399.550579 hartree
zpe.sumelectthermalfe: -399.600546 hartree
dipole: -1.8533 3.6150 -0.1497
dipole: 4.0651
quadrupole: -70.4069 -70.8410 -62.1547
quadrupole: -4.8797 2.2529 -1.3673
quadrupole: -2.6060 -3.0401 5.6462 -4.8797 2.2529 -1.3673
hfenergy: -399.7480955 hartree
pointgroup: C01 [X(C6H13Br1O2)]
dipole: -1.2128895 1.041935 -0.0336773 debye
dipolederiv: -0.5729683 -0.1065355 0.0671662 -0.1229403 -0.1796877 0.0249191 0.1641925 0.0469887 -0.1892789 -0.9697364 -0.1790494 0.0814003 -0.1515851 -0.3613681 -0.172281 0.024969 -0.2141396 -0.4122443 -0.2613278 -0.0931866 0.0233962 -0.115311 -0.9092875 -0.0088644 0.0065865 0.027528 -0.547137 -0.2291434 -0.064367 0.0266147 -0.1074304 -0.1291266 -0.0244638 0.2517946 -0.0610823 -0.127796 0.1110068 0.0080109 0.004986 -0.0226319 0.0633665 0.0032386 0.0325985 -0.0324448 0.0488467 0.6142029 0.1612527 0.0498637 0.0985326 0.2771326 0.0789877 -0.140315 0.0967713 0.3103606 0.2053495 0.0510133 -0.0105774 0.1071141 0.6027704 -0.0787039 0.0004155 -0.0281087 0.3384494 0.789514 0.2059234 -0.1981027 0.2122342 0.0800884 -0.0580679 -0.230568 -0.0274511 0.1460672 0.0643227 0.0318025 -0.0179658 0.0059015 -0.0930675 -0.0332907 -0.0296062 -0.008265 0.0474415 -0.1647003 -0.043174 -0.1395487 -0.053444 0.0023626 -0.0412394 -0.1113871 -0.0335352 0.0232707 0.0082237 -0.0041002 0.1323052 0.0162896 0.0380869 -0.0118234 0.0871363 -0.0147042 -0.0419474 -0.0165326 0.0400299 0.0167523 0.0490526 -0.104295 -0.1448594 0.0160685 -0.1001893 0.0285955 0.0616768 0.0015115 -0.0680522 -0.0013217 0.002367 0.1099862 -0.0623679 0.0632457 -0.0160836 -0.0428351 0.0079175 0.1054749 0.0137426 0.0626089 0.0213807 0.0637126 0.0252034 0.0539389 -0.0472481 0.0043709 -0.1702949 -0.0025308 -0.0208947 0.0598257 -0.1180923 0.036987 -0.1049612 -0.0218453 -0.0259612 0.0520373 0.0394908 0.0152195 0.1019454 0.0427257 0.0796778 0.0385713 -0.0401328 -0.0122743 0.0926567 -0.0532129 0.0077152 -0.0907601 0.0709461 -0.0861445 -0.0368276 0.0771848 0.0547399 -0.035109 0.0549395 -0.0948893 0.096653 -0.0493261 0.139572 -0.0078376 -0.0253156 0.0116414 0.1259506 -0.028467 0.0856425 0.0066494 0.1309151 -0.0428422 -0.0699875 -0.0757862 -0.0764407 -0.077572 -0.0354069 0.0894318 -0.0212654 -0.0683354 -0.0452432 0.0399756 0.3950108 0.0371112 -0.0662393 0.0557262 0.142489 0.1230993 -0.1045977 0.1100263 0.175932 0.1410798 -0.0102365 0.0048581 0.0412581 0.4233351 0.0589344 0.0225349 0.06815 0.3026517 unknown
polarizability: 104.3488504|8.5225632|82.7320047|-6.7262794|-3.9460436|73.2693574 unknown
InChI: InChI=1S/C6H13BrO2/c1-2-6(3-7,4-8)5-9/h8-9H,2-5H2,1H3
charge 0 multiplicity 1
22 atoms
Br 2.857539 0.720637 -0.026367
O  -2.381737 -0.977507 0.429322
O  -0.036861 -2.511378 -0.115428
C  -0.072178 0.002631 0.068696
C  -0.361629 1.239822 -0.831871
C  -1.25668 -0.261182 1.06106
C  0.092257 -1.251037 -0.8489
C  1.167524 0.155974 0.969757
C  -0.365531 2.612383 -0.12483
H  -1.342655 1.078879 -1.330917
H  0.38773 1.258983 -1.646937
H  -1.606437 0.687102 1.513058
H  -0.937438 -0.938872 1.86906
H  1.105703 -1.260588 -1.283439
H  -0.645167 -1.198265 -1.676412
H  1.438664 -0.812502 1.419809
H  1.050019 0.930308 1.744731
H  -0.628017 3.410454 -0.842566
H  -1.099228 2.660467 0.701635
H  0.631255 2.854259 0.284401
H  -2.800985 -0.40075 -0.257123
H  -1.002846 -2.611616 0.100858
