program: Gaussian 09
title: 000279482
version: EM64L-G09RevD.01
frameworkgroup: C1[X(C6H14N2O)]
method: RPBEPBE
basis: SDD
operation: Freq
keyword: #p
keyword: freq=noraman
keyword: PBEPBE/SDD
title: #p freq=noraman PBEPBE/SDD
converged: YES YES NO NO
title: Mulliken charges:
elementType: O N N C C C C C C H H H H H H H H H H H H H H
charge: -0.272185 -0.080036 -0.071607 -0.335588 -0.379457 -0.613102 -0.614361 -0.599495 -0.055683 0.202564 0.211589 0.262718 0.219846 0.219515 0.232243 0.194847 0.223649 0.191371 0.222947 0.235304 0.229951 0.219690 0.155280
chargesum: 0.00000
title: Mulliken charges with hydrogens summed into heavy atoms:
elementType: O N N C C C C C C
charge: -0.272185 -0.080036 -0.071607 0.078565 0.103107 0.033503 0.023606 0.085450 0.099597
polarizability: 9.53985035e+01 -1.47800507e+00 8.77391192e+01 3.47799438e+00 -2.24831909e+00 6.46126619e+01
1716.lowfreq: -24.7749 -0.0005 -0.0003 0.0009 7.3277 9.7060 19.5874 42.7563 92.6735
frequency: 9.6027 42.7185 92.6065 121.0799 137.6350 206.0535 220.5313 233.2719 256.9163 298.8076 323.2209 374.0484 403.0819 435.9545 487.7522 629.3310 782.5282 816.2708 884.6380 956.0783 1021.4680 1034.6153 1048.1059 1058.9747 1068.3689 1088.6093 1116.6034 1130.1010 1153.6940 1227.1169 1259.5291 1264.9551 1300.4199 1330.7091 1375.1289 1376.1936 1391.8183 1420.4479 1437.5021 1442.1222 1450.8172 1461.0418 1462.5754 1468.5569 1475.1416 1477.9090 1485.8929 1494.9552 1626.4484 2854.3354 2863.1237 2877.0061 2921.1274 2966.1715 3010.5439 3015.8917 3017.6770 3033.6503 3041.4599 3075.5659 3082.0206 3086.3940 3092.3858
redmass: 2.9106 4.2257 2.0119 2.4596 1.2241 1.4683 1.2720 1.5478 2.8266 2.7627 2.2140 2.4773 2.3488 2.9429 3.0674 4.8581 1.3145 4.0458 3.6310 1.5939 2.5000 1.5970 1.5476 2.2496 1.9629 1.3156 1.3046 1.4812 1.8463 2.8575 1.9756 2.5126 1.2773 1.3920 1.2831 1.5391 1.8089 1.1456 1.1985 1.1468 1.0931 1.0532 1.0520 1.0628 1.0648 1.0679 1.0566 1.0873 6.2022 1.0572 1.0623 1.0629 1.0853 1.0343 1.0607 1.0877 1.0735 1.0739 1.1016 1.1011 1.0986 1.1024 1.1005
irintensity: 3.1771 4.7939 0.3476 0.7560 1.3610 0.5363 0.1340 0.2758 3.5963 14.8040 2.0244 16.4808 0.9708 17.7467 9.6040 6.3232 7.4798 6.5604 6.9163 1.9569 18.0538 21.9347 34.2962 29.4366 31.3533 5.8371 0.2972 20.4778 14.9220 7.5706 35.7537 1.9468 4.0890 3.9908 32.1506 25.3351 7.2646 1.9141 9.4315 1.5446 11.6094 13.4648 21.8052 1.7147 12.0112 23.2482 15.1121 25.9914 332.3189 77.5682 63.7272 170.9595 107.8962 62.7460 30.1774 23.1889 54.2686 43.8680 37.5333 31.6174 29.5784 27.0795 26.0354
temp: 298.150 k
press: 1.00000 atm
elementType: 8 7 7 6 6 6 6 6 6 1 1 1 1 1 1 1 1 1 1 1 1 1 1
symmnumber: 1
zpe: 523960.2 jmol-1
zpe.correction: 0.199566 hartree
zpe.thermalcorrener: 0.211114 hartree
zpe.thermalcorrenthalpy: 0.212059 hartree
zpe.thermalcorrgfe: 0.160295 hartree
zpe.sumelectzpe: -420.987117 hartree
zpe.sumelectthermal: -420.975568 hartree
zpe.sumelectthermalent: -420.974624 hartree
zpe.sumelectthermalfe: -421.026388 hartree
dipole: 0.7586 -3.9313 0.0116
dipole: 4.0038
quadrupole: -52.6470 -60.8160 -57.4621
quadrupole: 11.1614 -2.3351 2.7475
quadrupole: 4.3280 -3.8410 -0.4870 11.1614 -2.3351 2.7475
hfenergy: -421.1866828 hartree
pointgroup: C01 [X(C6H14N2O1)]
dipole: -0.151252 -1.5233421 -0.3713423 debye
dipolederiv: -0.4584393 0.2135786 0.0531716 -0.1727049 -1.1247324 -0.3808182 -0.1095529 -0.2370975 -0.4958764 -0.6770307 -0.0308527 0.0466589 -0.0178534 -0.5139817 -0.0271153 0.0062471 -0.0216075 -0.5508916 -0.6969661 -0.2729427 -0.1777713 -0.1209074 -0.8008719 -0.2553898 -0.1389274 -0.3699703 -0.5436015 0.5061874 -0.0401557 0.109756 -0.0639185 0.1459174 0.1190815 0.0813959 0.0731472 0.3105266 0.4134036 0.0171621 0.0735215 -0.0752861 0.0555277 -0.0931711 0.0673203 0.0172912 0.2668579 0.1034401 -0.1205195 -0.0326909 -0.1601515 0.3646473 0.0779623 -0.0526309 0.0724381 0.3351184 0.2911106 0.1532867 -0.1270837 0.2181404 0.2405247 -0.0147553 -0.1530008 -0.0212626 0.3756026 0.1341192 -0.1258708 -0.1255541 -0.0931551 0.4481069 0.0858161 -0.1336551 0.0498688 0.247514 0.6579064 0.0756466 0.3074602 0.2606992 1.3973295 0.6362741 0.3786441 0.6385523 0.5281436 0.0425062 0.0392126 -0.0125673 0.0586637 -0.1716935 0.042164 -0.0176537 0.0121534 0.0544285 -0.0626763 0.0076857 0.0058464 -0.0336802 0.0291505 -0.1136453 -0.0891291 -0.0415087 -0.2097677 0.0759587 0.0126191 -0.0030342 0.0656887 -0.0505352 0.0653572 0.0281851 -0.0094564 0.0967892 0.0218947 -0.0132747 -0.0093091 -0.0013485 0.0756198 -0.0891179 0.0034707 -0.0616022 -0.1257226 -0.142675 0.0811872 -0.1191878 0.0084871 0.0793962 -0.0110351 -0.1086274 0.0027186 0.0332868 0.0139391 -0.1367711 0.100994 -0.097009 -0.0327948 0.0490283 0.0966274 0.0429419 0.0374894 0.0544663 0.0485697 0.0104468 0.059673 -0.0636424 -0.0281113 0.0934095 -0.1891606 -0.2101339 -0.1596367 -0.0236309 -0.0903613 0.0483934 0.1013721 0.0339873 -0.1171736 0.0218164 0.0109533 -0.017436 -0.0693207 0.0485472 -0.0265723 0.0202316 -0.0761927 0.2002566 0.0546146 -0.269361 0.078483 0.1066306 0.0274407 0.0291022 -0.1703285 -0.0141339 0.0422757 -0.0088379 0.0784547 0.1051008 0.0315466 0.0170386 0.0177457 0.0066098 -0.01951 0.0696969 -0.1006291 -0.1692602 0.0268938 -0.1351842 0.0721975 -0.0748704 -0.1260443 0.0030427 0.0688902 0.0519707 0.0521952 -0.1037549 0.0738999 -0.0733081 -0.0210982 0.0980411 -0.0229389 -0.1252063 0.0244966 0.0671991 -0.2067946 0.1074975 -0.1022115 0.1919621 -0.0078498 0.0332215 -0.0908622 -0.0008769 0.0800555 unknown
polarizability: 94.453866|0.7173629|85.6995488|5.6500173|7.4946136|67.5968698 unknown
InChI: InChI=1S/C6H14N2O/c1-7(2)4-5-8(3)6-9/h6H,4-5H2,1-3H3
charge 0 multiplicity 1
23 atoms
O  1.857696 1.774602 1.182622
N  -2.162514 -0.343068 -0.254411
N  1.636588 -0.29571 0.092194
C  -0.845166 -0.563388 0.38424
C  0.307545 0.034162 -0.461303
C  -2.604096 1.068085 -0.202378
C  -3.199234 -1.256145 0.270868
C  2.222393 -1.60898 -0.207186
C  2.300633 0.629875 0.879552
H  -0.695681 -1.65671 0.473646
H  -0.792129 -0.135308 1.416963
H  0.237858 1.134706 -0.485243
H  0.231001 -0.353278 -1.494334
H  -3.564422 1.170704 -0.738252
H  -1.870711 1.723302 -0.701168
H  -2.744932 1.442273 0.843107
H  -4.136812 -1.115908 -0.296747
H  -3.427898 -1.095986 1.355297
H  -2.875718 -2.304432 0.140071
H  2.363584 -1.740275 -1.297216
H  1.581219 -2.432828 0.160008
H  3.207278 -1.695442 0.284245
H  3.292918 0.254947 1.224126
