program: Gaussian 09
title: 000279516
version: EM64L-G09RevD.01
frameworkgroup: C1[X(C14H17Cl2NO4)]
method: RPBEPBE
basis: SDD
operation: Freq
keyword: #p
keyword: freq=noraman
keyword: PBEPBE/SDD
title: #p freq=noraman PBEPBE/SDD
converged: YES YES NO NO
title: Mulliken charges:
elementType: Cl Cl O O O O N C C C C C C C C C C C C C C H H H H H H H H H H H H H H H H H
charge: -0.071282 -0.062760 -0.278432 -0.285285 -0.233518 -0.210508 -0.141987 0.523744 -0.422750 -0.416849 -0.480262 -0.379828 -0.552694 -0.556711 0.273731 0.202663 -0.371870 0.271541 0.260049 -0.753512 -0.749898 0.249631 0.274592 0.234170 0.277010 0.300554 0.228409 0.267877 0.293002 0.262674 0.290074 0.248615 0.249686 0.246449 0.264803 0.245374 0.251424 0.252074
chargesum: 0.00000
title: Mulliken charges with hydrogens summed into heavy atoms:
elementType: Cl Cl O O O O N C C C C C C C C C C C C C C
charge: -0.071282 -0.062760 -0.278432 -0.285285 -0.233518 -0.210508 -0.141987 0.523744 0.101473 0.094331 -0.179708 -0.151419 0.008185 -0.003962 0.273731 0.202663 -0.123255 0.271541 0.260049 0.007426 -0.001026
polarizability: 2.67708710e+02 -1.09504022e+00 1.78293481e+02 -8.92708846e-01 2.62032957e+01 1.49546097e+02
1716.lowfreq: -5.4532 -3.6659 -0.0018 0.0004 0.0011 4.2846 19.1267 26.7196 29.2947
frequency: 18.9993 26.6954 29.2638 43.7666 53.4036 55.9456 62.6689 64.5729 77.5585 84.3378 89.8191 104.6165 116.2210 124.2646 160.6465 178.8489 215.0267 241.4867 260.8381 273.3639 298.6328 338.6236 353.9999 378.2365 424.3627 431.8208 454.1560 475.7664 510.5438 531.8146 541.9293 549.6698 562.9231 597.2826 600.6053 606.1911 617.8117 649.7905 666.0061 714.9082 753.0474 783.8693 798.9052 860.3694 867.2948 870.2038 872.1666 920.6119 928.3624 938.3075 951.4622 988.1970 999.7308 1007.1637 1032.5752 1038.7978 1041.1433 1050.6286 1082.4540 1155.6588 1161.7195 1163.9171 1179.3956 1182.0386 1186.1420 1218.6589 1245.3245 1262.0679 1278.2177 1297.8390 1306.9663 1353.1812 1357.4548 1377.8603 1382.0729 1382.2824 1388.2712 1428.6643 1440.6210 1442.4637 1451.2349 1451.8211 1453.3376 1454.8774 1467.3854 1492.0673 1509.0309 1580.5852 1620.2633 1656.3396 1682.7157 2973.2355 2980.1939 3007.1733 3008.0844 3054.4505 3060.3089 3073.3568 3080.6709 3096.3065 3097.4133 3143.3175 3143.4385 3144.5362 3149.0019 3154.5219 3177.3516 3226.5117
redmass: 9.7052 9.3777 8.7001 5.8978 4.4482 2.2689 4.6487 5.3311 1.2388 1.3654 5.8298 4.5175 3.5501 4.3929 5.1835 4.4532 7.0510 4.7646 8.8087 5.7123 3.3943 3.0553 5.8069 3.2038 3.2221 3.2022 3.3314 3.6588 2.6565 3.5239 3.2179 3.1480 3.7726 4.8238 4.4557 4.3466 4.1910 5.5781 4.3443 3.9621 4.3766 3.0740 1.9545 6.9316 2.2054 2.4828 1.5849 1.8982 1.3668 2.8270 2.3523 2.0427 1.9108 1.8485 2.7196 1.6538 1.6369 1.7935 3.7551 1.4715 1.1761 2.3848 2.1912 2.4080 1.7984 1.9772 1.6356 1.5277 1.4939 1.2427 1.2093 1.3882 1.5090 3.9612 1.2803 1.2758 1.9297 2.9313 1.0984 1.1766 1.0562 1.0506 1.0508 1.0567 1.1204 1.2900 2.4005 7.8466 6.8920 9.5032 10.3002 1.0689 1.0689 1.0368 1.0370 1.0583 1.0584 1.0927 1.0927 1.0972 1.0966 1.1020 1.1095 1.1012 1.1102 1.0881 1.0956 1.0903
irintensity: 0.5751 0.7594 0.5720 1.0852 1.1825 3.7674 1.1391 6.0365 0.1138 0.5871 3.3403 0.7742 7.6075 7.2240 4.5984 2.6080 0.6181 0.2026 0.4015 0.7141 1.3115 1.6891 2.1165 3.3963 4.7558 0.2049 16.8870 13.8402 9.3415 14.1812 9.4675 4.7934 4.3025 0.8534 16.8997 22.4792 10.1172 3.4624 0.6168 0.9460 3.0656 7.7756 42.5193 86.6991 38.6653 23.2944 15.0541 63.8449 6.6984 14.2496 9.6534 74.7223 101.2195 4.1269 35.7541 9.9699 8.1540 1.4835 101.0328 36.0550 34.0576 282.1196 96.5719 386.8568 254.7244 45.6950 23.5023 26.6534 2.4561 1.9818 34.0749 40.5383 106.5145 4.0580 60.9764 59.6187 11.8619 1.2596 2.6260 22.3087 26.3862 39.6291 18.7253 12.3989 34.8002 50.1246 318.3505 17.5325 160.1034 210.6455 159.6171 33.8237 15.6548 0.7501 2.5069 20.6079 12.6269 2.0403 7.2118 5.2421 7.6622 16.5103 14.2953 9.6344 15.2102 8.7656 13.2078 8.1924
temp: 298.150 k
press: 1.00000 atm
elementType: 17 17 8 8 8 8 7 6 6 6 6 6 6 6 6 6 6 6 6 6 6 1 1 1 1 1 1 1 1 1 1 1 1 1 1 1 1 1
symmnumber: 1
zpe: 759347.9 jmol-1
zpe.correction: 0.289220 hartree
zpe.thermalcorrener: 0.312224 hartree
zpe.thermalcorrenthalpy: 0.313168 hartree
zpe.thermalcorrgfe: 0.232316 hartree
zpe.sumelectzpe: -1817.873854 hartree
zpe.sumelectthermal: -1817.850850 hartree
zpe.sumelectthermalent: -1817.849906 hartree
zpe.sumelectthermalfe: -1817.930758 hartree
dipole: -2.1234 -0.5839 -2.1043
dipole: 3.0459
quadrupole: -123.2889 -129.2235 -148.1510
quadrupole: -9.5861 2.5570 12.3962
quadrupole: 10.2655 4.3310 -14.5965 -9.5861 2.5570 12.3962
hfenergy: -1818.1630745 hartree
pointgroup: C01 [X(C14H17Cl2N1O4)]
dipole: 0.8414022 -0.1970575 0.8302381 debye
polarizability: 267.6875567|-0.0860941|175.6620903|-2.290951|-27.4684845|152.1986407 unknown
InChI: InChI=1S/C14H17Cl2NO4/c1-10(18)20-13-4-3-12(9-14(13)21-11(2)19)17(7-5-15)8-6-16/h3-4,9H,5-8H2,1-2H3
charge 0 multiplicity 1
38 atoms
Cl -4.417521 2.334531 1.504247
Cl -4.669577 -1.837284 -1.978617
O  2.127482 1.122662 -0.32129
O  2.836342 -1.135284 1.079285
O  0.952454 2.695768 -1.628396
O  3.435741 -1.407202 -1.178814
N  -2.671075 -0.109698 0.074387
C  -1.309045 -0.369948 0.311841
C  -3.099156 1.085522 -0.667877
C  -3.711269 -1.02717 0.558803
C  -0.307378 0.534792 -0.161867
C  -0.879627 -1.529705 1.030067
C  -3.092224 2.386129 0.148231
C  -3.90989 -2.284359 -0.30157
C  1.05596 0.272947 0.068195
C  1.466593 -0.889733 0.766081
C  0.489381 -1.774108 1.246576
C  2.023382 2.240209 -1.177334
C  3.763575 -1.338104 0.01815
C  3.411131 2.773077 -1.447839
C  5.154947 -1.446533 0.597985
H  -2.449191 1.238337 -1.553467
H  -4.111537 0.90523 -1.065045
H  -3.477925 -1.354405 1.592885
H  -4.66297 -0.474803 0.62875
H  -0.565393 1.434973 -0.714652
H  -1.59882 -2.25163 1.423484
H  -3.350453 3.255154 -0.476411
H  -2.146635 2.554965 0.681768
H  -4.625109 -2.982396 0.161424
H  -2.964919 -2.791172 -0.543294
H  0.813911 -2.664159 1.794358
H  3.940089 2.968591 -0.499654
H  3.34316 3.696567 -2.040258
H  3.994253 2.016614 -2.002279
H  5.861493 -1.760329 -0.183662
H  5.463978 -0.466291 1.002626
H  5.168343 -2.16456 1.434784
