program: Gaussian 09
title: 000025529
version: EM64L-G09RevD.01
frameworkgroup: C1[X(C14H9ClN2O4)]
method: RPBEPBE
basis: SDD
operation: Freq
keyword: #p
keyword: freq=noraman
keyword: PBEPBE/SDD
title: #p freq=noraman PBEPBE/SDD
converged: YES YES NO NO
title: Mulliken charges:
elementType: Cl O O O O N N C C C C C C C C C C C C C C H H H H H H H H H
charge: 0.010739 -0.458824 -0.461253 -0.361366 -0.385059 -0.672333 -0.662125 0.184588 0.176540 0.150193 0.136955 -0.006120 -0.014419 0.337304 0.299421 0.194713 0.056767 -0.461394 -0.313868 -0.398776 -0.332140 0.255273 0.231511 0.262034 0.312364 0.403224 0.403110 0.309436 0.404019 0.399486
chargesum: 0.00000
title: Mulliken charges with hydrogens summed into heavy atoms:
elementType: Cl O O O O N N C C C C C C C C C C C C C C
charge: 0.010739 -0.458824 -0.461253 0.042654 0.014426 0.043255 0.050421 0.184588 0.176540 0.150193 0.136955 -0.006120 -0.014419 0.337304 0.299421 0.194713 0.056767 -0.206121 -0.313868 -0.167264 -0.070106
polarizability: 4.23634376e+02 -2.63593457e+01 2.48810578e+02 -1.53405172e-02 2.83718282e-03 7.16501040e+01
1716.lowfreq: -8.1322 -0.0015 -0.0011 0.0014 5.2688 7.9697 48.6144 74.2670 111.0017
frequency: 48.6135 74.2670 111.0011 151.9491 156.4576 162.2466 174.4582 221.3346 237.6377 269.1386 279.4619 307.2706 348.9642 352.9420 379.9026 397.6254 431.7178 432.9544 448.3339 452.1867 470.3531 479.7415 485.3841 488.4884 500.1216 504.6051 511.0970 559.9644 564.6583 633.9754 643.2874 675.2078 702.4321 733.1428 747.9529 753.2016 801.1930 821.9029 829.0270 830.5706 834.1568 860.6598 864.7407 954.8568 959.3734 977.0250 998.6962 1011.2935 1023.0830 1066.7902 1110.2637 1137.7259 1174.5828 1238.6715 1264.3752 1283.3332 1283.8973 1310.7393 1338.3397 1342.4233 1351.8767 1417.1019 1433.2769 1441.1169 1446.9149 1462.7119 1473.5445 1516.0636 1526.7536 1548.2688 1561.5848 1608.7248 1616.7828 1621.8476 1636.8637 2433.7031 2512.9396 3133.5360 3155.4235 3175.2624 3287.5124 3296.0719 3627.2077 3629.6457
redmass: 10.0317 6.3067 8.0485 6.6830 11.6722 10.5029 6.8017 6.8067 7.4399 5.9074 8.4331 4.8039 6.0497 5.0380 6.4800 4.1871 6.9746 5.9567 9.0713 9.2038 7.5725 1.4713 7.7487 1.2455 8.1537 5.5854 2.7049 5.9691 3.7764 4.8465 5.5056 6.8455 6.5782 7.1677 4.9279 8.5541 6.1535 1.5143 7.2902 1.1977 1.2204 8.7321 1.5729 7.3686 1.3429 4.8664 4.3085 1.0629 1.0591 1.8953 1.5962 1.8640 1.5042 2.1001 3.0253 2.7522 4.7006 4.6741 3.6485 4.8624 3.1833 5.2199 5.3049 6.5884 5.2230 3.0511 2.6646 5.6434 3.8909 2.0700 2.2952 4.0809 1.5788 1.7654 7.9724 1.0751 1.0729 1.0895 1.0924 1.0958 1.0618 1.0612 1.0905 1.0901
irintensity: 0.3764 6.5369 0.4332 0.8465 1.2502 0.0000 0.3664 0.9651 0.5737 0.0057 0.6756 0.2552 1.9991 1.5124 1.2811 4.4316 0.8421 1.2781 24.6338 5.4475 2.1589 145.3888 15.9181 77.2476 24.6838 2.4698 28.1143 4.3232 12.7239 0.1206 5.7352 4.2876 0.8931 6.1640 30.4577 43.0721 0.3850 101.0476 3.3311 163.6131 0.7556 15.2298 16.7956 60.2302 1.3089 10.6059 25.7374 132.8912 180.2597 42.4104 1.0139 49.2222 126.2937 3.9013 12.7541 164.2772 35.5588 291.1248 98.0789 587.2230 41.1645 7.2620 71.6317 54.0909 6.6179 214.7244 59.8040 277.3965 58.1855 232.9421 12.4828 254.0820 32.9335 290.6878 33.6553 93.5711 82.8602 14.0697 2.2726 9.5011 54.3094 49.5564 92.0455 81.6707
temp: 298.150 k
press: 1.00000 atm
elementType: 17 8 8 8 8 7 7 6 6 6 6 6 6 6 6 6 6 6 6 6 6 1 1 1 1 1 1 1 1 1
symmnumber: 1
zpe: 545045.7 jmol-1
zpe.correction: 0.207597 hartree
zpe.thermalcorrener: 0.223807 hartree
zpe.thermalcorrenthalpy: 0.224751 hartree
zpe.thermalcorrgfe: 0.164861 hartree
zpe.sumelectzpe: -1407.976678 hartree
zpe.sumelectthermal: -1407.960469 hartree
zpe.sumelectthermalent: -1407.959524 hartree
zpe.sumelectthermalfe: -1408.019414 hartree
dipole: 2.1258 0.3017 0.0060
dipole: 2.1471
quadrupole: -119.1266 -114.2518 -131.1376
quadrupole: -33.0200 -0.0086 0.0223
quadrupole: 2.3788 7.2535 -9.6323 -33.0200 -0.0086 0.0223
hfenergy: -1408.1842752 hartree
pointgroup: C01 [X(C14H9Cl1N2O4)]
dipole: -0.8269455 -0.172385 0.0010778 debye
polarizability: 426.2994103|-14.8913498|246.1442037|0.3484112|0.401969|71.6514438 unknown
InChI: InChI=1S/C14H9ClN2O4/c15-4-3-6(17)9-11(12(4)19)14(21)8-5(16)1-2-7(18)10(8)13(9)20/h1-3,18-19H,16-17H2
charge 0 multiplicity 1
30 atoms
Cl 5.143408 1.041577 0.01024
O  -0.577845 -2.813901 -0.004184
O  0.066963 2.710534 0.01083
O  2.5219 2.490816 0.011403
O  -3.045534 -2.581998 -0.007909
N  2.016149 -3.109497 0.000393
N  -2.524795 3.006859 0.009275
C  0.927289 -0.913195 0.003122
C  -1.435722 0.809961 0.004599
C  1.066599 0.520621 0.006444
C  -1.572393 -0.62547 0.000468
C  -0.399709 -1.495765 0.000096
C  -0.109711 1.392057 0.007742
C  2.107528 -1.73793 0.002539
C  -2.61572 1.635546 0.005336
C  2.35872 1.136877 0.008708
C  -2.870467 -1.22307 -0.003193
C  3.395314 -1.104263 0.004739
C  3.507679 0.282139 0.007685
C  -3.905986 0.997357 0.001917
C  -4.030728 -0.388643 -0.002275
H  4.300519 -1.719805 0.004244
H  -4.804728 1.625157 0.002496
H  -5.011289 -0.873293 -0.005122
H  2.852732 -3.688564 0.000076
H  1.06063 -3.505921 0.00139
H  -1.571682 3.407701 0.011739
H  -3.363496 3.583267 0.009831
H  1.539141 2.890883 0.011053
H  -2.073766 -2.991634 -0.009182
