program: Gaussian 09
title: 000279448
version: EM64L-G09RevD.01
frameworkgroup: C1[X(C8H15NO)]
method: RPBEPBE
basis: SDD
operation: Freq
keyword: #p
keyword: freq=noraman
keyword: PBEPBE/SDD
title: #p freq=noraman PBEPBE/SDD
converged: YES YES NO NO
title: Mulliken charges:
elementType: O N C C C C C C C C H H H H H H H H H H H H H H H
charge: -0.451158 -0.083585 0.367132 -0.437232 -0.436418 -0.531018 -0.547648 -0.741974 -0.755191 0.198480 0.206413 0.208327 0.208047 0.205503 0.219270 0.234939 0.266794 0.223222 0.212579 0.211893 0.211817 0.213032 0.220425 0.212905 0.363446
chargesum: 0.00000
title: Mulliken charges with hydrogens summed into heavy atoms:
elementType: O N C C C C C C C C
charge: -0.087712 -0.083585 0.367132 -0.022492 -0.022868 -0.076809 -0.057632 -0.105685 -0.108828 0.198480
polarizability: 1.23925869e+02 -2.32556594e+00 8.75913389e+01 -4.88508025e+00 -5.94993281e-01 7.77003915e+01
1716.lowfreq: -23.8545 -15.8226 0.0002 0.0003 0.0004 17.8413 54.8273 143.8429 180.5812
frequency: 54.6778 143.8366 180.5801 189.5610 230.4798 252.0565 278.5380 291.9531 328.8655 372.7700 390.3968 406.4933 414.3004 458.8825 496.9768 544.2290 665.0708 694.2603 758.7524 771.4625 851.5895 884.1781 907.5952 927.3736 942.8981 954.3586 1004.9704 1014.5506 1018.2125 1031.9531 1131.8651 1134.1436 1160.2623 1168.1394 1217.3325 1237.2940 1267.1087 1282.1889 1301.2561 1314.6229 1329.6808 1337.8441 1357.9652 1372.3752 1391.9780 1453.0347 1454.5002 1455.5719 1467.9687 1468.3844 1474.9962 1481.5267 1489.6947 1619.7114 2963.0217 2967.1127 2969.6333 2973.9484 2976.1128 2978.5575 3026.3668 3031.4450 3058.7795 3060.6192 3061.9519 3065.8624 3072.7599 3081.2123 3571.0935
redmass: 3.8111 1.8391 3.2492 1.2690 1.1726 2.6903 2.3139 3.3480 2.4794 1.7632 1.8725 1.7233 1.7253 2.8931 2.5154 4.6135 3.3293 3.0582 3.0115 1.5422 4.7949 2.1289 2.1680 1.5414 1.4625 1.7644 1.4788 1.7536 1.7930 2.3012 1.1714 1.5855 1.8274 1.7030 1.5527 1.7915 1.7598 1.9513 1.3033 1.5176 1.4550 1.7818 1.6024 1.2086 1.2150 1.0751 1.0727 1.0773 1.0609 1.0768 1.0741 1.0622 1.0612 7.0468 1.0364 1.0596 1.0478 1.0635 1.0506 1.0660 1.1015 1.1011 1.0990 1.0978 1.0981 1.0987 1.0976 1.0934 1.0674
irintensity: 0.0530 0.1056 0.1804 0.0045 0.0284 0.6944 0.8163 2.3587 5.2291 25.9126 19.3776 21.5871 67.8783 3.9165 14.0239 19.2412 3.2558 2.2770 0.4799 3.3356 117.0250 22.9969 1.2761 5.6532 1.1482 25.1073 2.2596 9.9351 3.2821 5.3561 0.9534 11.1967 24.9450 16.5822 31.2137 4.5927 7.9687 1.0753 6.8531 8.3692 1.3629 1.9201 3.8386 21.2961 18.3959 7.1632 9.4440 5.1928 14.6093 9.7405 12.0110 15.0726 10.1847 7.9377 21.4396 45.1833 42.8933 20.5248 26.1434 29.3734 25.6128 43.7371 3.7175 10.5611 71.5266 70.6902 49.6096 9.5866 35.4555
temp: 298.150 k
press: 1.00000 atm
elementType: 8 7 6 6 6 6 6 6 6 6 1 1 1 1 1 1 1 1 1 1 1 1 1 1 1
symmnumber: 1
zpe: 572351.8 jmol-1
zpe.correction: 0.217997 hartree
zpe.thermalcorrener: 0.228793 hartree
zpe.thermalcorrenthalpy: 0.229737 hartree
zpe.thermalcorrgfe: 0.182641 hartree
zpe.sumelectzpe: -442.972144 hartree
zpe.sumelectthermal: -442.961349 hartree
zpe.sumelectthermalent: -442.960405 hartree
zpe.sumelectthermalfe: -443.007501 hartree
dipole: -1.3159 -0.0427 0.0907
dipole: 1.3197
quadrupole: -60.0427 -62.7403 -62.0115
quadrupole: -0.7179 -1.8083 0.2071
quadrupole: 1.5555 -1.1422 -0.4133 -0.7179 -1.8083 0.2071
hfenergy: -443.1901416 hartree
pointgroup: C01 [X(C8H15N1O1)]
dipole: -0.5179282 -0.0114638 0.0345456 debye
dipolederiv: -0.7896207 0.327835 -0.0032229 0.9847842 -0.5392566 -0.1847707 -0.0595873 -0.0658085 -0.3608147 0.3184126 -0.287143 -0.0815186 -0.8683314 0.0622607 0.1290969 0.0222189 0.0272827 -0.186502 0.1037277 -0.0008812 -0.0280468 -0.0002754 0.0739065 0.0003788 -0.0684475 -0.0033011 0.1036193 0.0979302 -0.0420107 -0.0220764 0.0422062 0.0520016 0.0054249 0.0387597 -0.0278623 0.0916734 0.1328368 0.0521463 -0.0225272 -0.0234667 0.0915115 0.0015304 0.0452464 0.0271449 0.0860828 -0.0755442 0.0365973 -0.0380118 -0.0616511 -0.0033835 -0.000402 0.000004 0.0184116 0.1282922 -0.1629553 -0.0481237 -0.0025302 0.0180313 -0.1195801 0.0495923 0.0361923 0.038617 0.1606488 -0.0320754 -0.0191679 -0.0571345 -0.0183463 0.0659954 -0.0139602 -0.0344346 -0.012669 0.0130925 0.0263301 0.0002563 0.0241018 0.0017047 0.0388881 -0.0106645 0.0443536 -0.00946 -0.0832659 0.1816229 0.0177505 -0.0866422 0.028505 0.2965933 -0.0592492 -0.203361 -0.0616202 -0.0472835 -0.1037137 0.1519832 -0.0050304 0.1090065 -0.1005135 -0.0029603 0.0091775 -0.0335888 0.0754041 0.0392842 -0.0289142 0.0494865 -0.0285032 0.0658464 -0.0361027 0.0201107 0.0151218 -0.1760229 0.0222642 0.025607 0.0363917 0.0250456 0.0691208 -0.0087762 0.0200337 -0.0658811 -0.1697045 -0.0472058 -0.1220068 0.0239815 -0.0933448 -0.1367515 0.049988 0.017921 0.0835944 0.0574706 0.0221186 0.0638927 0.0516306 0.0876089 0.0694426 -0.015211 0.0333179 -0.063328 -0.1350848 0.0006628 -0.1167389 0.0212024 -0.0699762 -0.0716489 0.0409664 0.0167383 0.0766444 0.0649612 0.0069777 0.1015705 -0.004593 0.0522043 -0.0205508 -0.0057239 -0.0025866 -0.0373004 0.0891235 0.0759782 -0.036279 0.0521916 -0.0849211 0.0715324 -0.0298336 0.0309474 0.0086272 -0.1277512 0.0566572 0.0065877 0.1017134 -0.0001673 0.0882266 -0.0164776 0.0339732 -0.0249544 -0.1630999 0.0056445 -0.0873725 -0.0004557 -0.1530018 -0.1101471 0.0348074 0.0355059 0.0770727 0.0627277 -0.061263 0.1025009 -0.0188309 0.1741504 -0.0620537 -0.0000629 0.0106129 -0.0337629 0.0789813 0.0205365 -0.0897631 0.0551173 -0.1375353 -0.1021175 0.0891928 0.030707 0.0322465 0.0553191 -0.0469721 -0.0336002 -0.1513954 -0.0307808 0.0781937 -0.0340466 -0.139864 -0.0300234 -0.0429576 -0.0408618 0.1207848 0.0464397 0.1585683 -0.0600952 -0.042965 0.0000177 0.0054221 0.0717168 0.2492277 -0.0955112 0.0597595 -0.1115139 0.2025785 0.0602286 0.0624428 0.0593746 0.3533735 unknown
polarizability: 123.8950573|-2.6967191|87.6443796|-4.7914183|-0.5420503|77.6781622 unknown
InChI: InChI=1S/C8H15NO/c1-8(2)5-3-7(9-10)4-6-8/h10H,3-6H2,1-2H3
charge 0 multiplicity 1
25 atoms
O  3.362999 -0.709587 -0.204862
N  2.547896 0.531048 -0.189457
C  -1.639606 -0.113834 -0.085577
C  -0.937125 1.208303 -0.522295
C  -0.624492 -1.287426 -0.231691
C  0.384867 1.484834 0.241665
C  0.714516 -1.066871 0.525431
C  -2.848765 -0.376947 -1.01947
C  -2.154498 -0.008858 1.375363
C  1.310667 0.283149 0.180743
H  -1.629103 2.062299 -0.381238
H  -0.715503 1.14863 -1.607395
H  -0.39996 -1.426663 -1.308662
H  -1.090795 -2.228219 0.122457
H  0.156191 1.707537 1.303939
H  0.900816 2.369458 -0.171447
H  1.434262 -1.86756 0.288778
H  0.533826 -1.103407 1.619136
H  -2.527086 -0.458277 -2.075213
H  -3.362354 -1.319042 -0.748237
H  -3.588948 0.442992 -0.952721
H  -2.665344 -0.94338 1.675248
H  -1.340648 0.172882 2.099853
H  -2.8807 0.820033 1.473712
H  4.237292 -0.362296 -0.517458
