program: Gaussian 09
title: 000279527
version: EM64L-G09RevD.01
frameworkgroup: C1[X(C19H20Cl2FN5O2S)]
method: RPBEPBE
basis: SDD
operation: Freq
keyword: #p
keyword: freq=noraman
keyword: PBEPBE/SDD
title: #p freq=noraman PBEPBE/SDD
converged: YES YES NO NO
title: Mulliken charges:
elementType: Cl Cl S F O O N N N N N C C C C C C C C C C C C C C C C C C C H H H H H H H H H H H H H H H H H H H H
charge: -0.050133 -0.006546 1.096156 -0.340969 -0.473084 -0.474099 -0.311972 -0.087276 -0.164998 -0.625387 -0.612533 0.190029 0.366030 -0.675022 -0.724974 -0.586762 0.623839 0.210765 -0.579451 -0.344112 -0.378489 -0.344933 -0.406358 -0.017883 0.651192 -0.323469 -0.382748 -0.111706 -0.215595 -0.231061 0.237538 0.237478 0.197755 0.234194 0.246445 0.219934 0.263359 0.231568 0.269224 0.237298 0.274247 0.265336 0.240522 0.337910 0.338584 0.259198 0.309312 0.289645 0.319104 0.322897
chargesum: 0.00000
title: Mulliken charges with hydrogens summed into heavy atoms:
elementType: Cl Cl S F O O N N N N N C C C C C C C C C C C C C C C C C C C
charge: -0.050133 -0.006546 1.096156 -0.340969 -0.473084 -0.474099 -0.311972 -0.087276 -0.164998 0.051107 0.029468 0.190029 0.366030 -0.002251 -0.024401 -0.091834 0.623839 0.210765 -0.072928 -0.069864 -0.113153 -0.344933 -0.165835 -0.017883 0.651192 -0.323469 -0.123550 -0.111706 0.093716 0.058584
polarizability: 5.31062521e+02 -1.69570981e+01 2.76334481e+02 2.28609256e+01 1.47630317e+00 1.96137163e+02
1716.lowfreq: -6.8412 -3.0244 -0.0021 0.0010 0.0013 4.0364 13.1006 17.0279 18.2955
frequency: 13.0405 16.9787 18.0486 24.0393 27.4968 41.1803 46.2433 58.6444 81.9009 89.5773 103.3016 112.9673 126.5454 132.9575 162.9036 175.6287 189.8302 194.4807 206.0752 211.5557 223.6591 237.2337 249.6339 256.7257 263.6976 275.7482 300.4516 306.3691 309.1233 314.0943 338.9289 352.7923 378.7241 384.3745 390.9632 397.4954 409.4387 416.6718 432.5360 443.6874 453.4585 455.5378 462.1620 489.3609 508.5980 517.3947 523.5059 531.1368 536.2337 543.8930 575.7096 597.6334 615.7802 631.0468 661.9116 667.8609 679.4006 694.7411 724.5979 726.9075 743.5865 783.4608 805.0892 811.9196 822.0926 837.1744 855.7457 863.1918 866.5455 884.0024 886.3469 912.0888 942.7937 950.9092 961.7929 968.3026 990.1925 991.7233 993.3856 1000.4080 1025.1458 1029.2704 1043.4776 1061.2973 1104.9083 1114.4093 1123.0159 1131.5586 1148.5032 1168.6614 1193.6408 1209.3067 1210.7936 1239.2542 1250.7445 1266.0732 1271.2769 1282.3135 1289.2716 1320.2416 1353.9375 1368.8671 1375.9147 1384.8274 1390.8776 1394.2621 1401.0506 1431.1593 1447.2655 1448.9623 1460.7375 1466.9701 1472.6970 1477.2848 1483.8844 1484.1840 1536.3902 1549.7874 1570.0849 1574.1911 1579.2603 1604.3484 1613.7971 1620.7116 2982.6808 3001.1199 3004.4291 3011.9532 3058.1079 3080.5933 3081.0411 3095.8656 3106.6946 3113.6543 3126.4016 3145.3440 3162.9717 3170.0327 3173.9257 3178.2848 3550.8597 3567.4384 3705.1365 3729.0727
redmass: 8.3602 7.5725 6.6508 7.1776 13.6732 6.5851 5.7376 6.1700 9.5110 6.1636 5.4112 11.0939 4.0575 5.7908 4.9328 3.8694 7.9467 2.7462 8.2146 2.6360 3.1592 5.0011 2.7739 1.2045 2.9694 5.7875 6.6487 3.3638 4.9854 3.0193 3.3635 5.9154 3.0539 1.2673 2.1845 2.3717 3.9966 4.6371 6.2239 3.3703 4.4125 3.5509 3.1539 2.4165 2.0477 5.6336 1.3956 1.7310 4.7656 3.3014 6.6857 5.2560 4.6787 5.6150 5.5144 8.3004 6.4738 5.3694 10.2887 4.1093 5.4391 1.2365 4.8508 3.5158 1.8064 1.4356 10.8440 2.6229 2.9951 1.6244 1.3732 1.5557 1.9987 3.7181 1.5491 1.4797 3.3682 2.0693 1.9188 3.0319 3.0579 4.5881 3.3805 2.3387 1.9107 1.4274 2.2076 2.0424 1.3028 1.1239 3.3178 2.2257 2.1516 3.7611 1.4427 1.6005 1.3630 2.0278 1.5890 1.3267 3.8774 1.2362 3.7486 5.1199 1.8652 2.4358 3.0672 4.8496 1.0561 2.4558 1.0705 1.0760 1.1439 1.0930 1.5284 1.5758 2.8622 4.8487 1.8141 8.2742 6.6945 4.1590 2.9874 2.0819 1.0352 1.0592 1.0356 1.0601 1.1011 1.0998 1.1049 1.0998 1.1005 1.0993 1.0893 1.0897 1.0955 1.0933 1.0965 1.0926 1.0445 1.0438 1.1052 1.1058
irintensity: 0.4739 0.8504 0.3746 1.8352 0.2105 0.9290 0.5311 1.3453 0.2824 0.8840 1.4341 3.1168 0.2662 0.3812 1.1863 0.9545 6.8985 1.4571 0.3307 0.8458 1.2069 4.1022 2.6276 0.2585 0.2262 7.2927 5.6505 10.5863 8.7707 0.7628 9.0179 4.4702 2.7462 214.3166 67.9782 67.9108 17.5676 61.9711 67.3336 9.6227 19.3561 15.9713 1.8606 64.2516 5.4271 2.0224 3.0552 51.2202 85.3874 6.2618 104.1516 34.9928 1.7347 25.8407 1.6075 7.7295 7.7094 29.3233 22.3408 2.7771 19.8581 2.0610 2.1226 63.3369 17.3760 57.9511 90.9952 4.3620 16.6557 6.1648 16.9725 0.8410 14.4618 12.2353 4.0073 2.0969 16.4069 19.5870 20.8090 18.7420 17.0699 41.5263 15.8154 50.9547 3.5950 5.9997 5.5687 47.4989 6.0862 11.2292 42.8521 1.2029 19.1677 25.4008 8.9836 34.9606 17.3593 53.6898 63.0409 20.5848 11.6800 37.3953 30.6159 4.3725 41.6025 49.0358 403.4920 262.0546 6.3131 38.0115 8.1962 15.8669 13.3410 10.6502 79.7453 105.1126 281.7570 51.0252 204.9783 9.8308 14.9749 562.7421 286.6027 358.5069 18.8758 6.0804 15.0925 27.3256 1.3894 29.8828 8.1121 13.7854 24.0721 29.2017 14.0550 4.9064 3.8354 10.0952 7.7414 0.7056 60.2571 109.2177 50.2006 39.4021
temp: 298.150 k
press: 1.00000 atm
elementType: 17 17 16 9 8 8 7 7 7 7 7 6 6 6 6 6 6 6 6 6 6 6 6 6 6 6 6 6 6 6 1 1 1 1 1 1 1 1 1 1 1 1 1 1 1 1 1 1 1 1
symmnumber: 1
zpe: 964211.6 jmol-1
zpe.correction: 0.367249 hartree
zpe.thermalcorrener: 0.397837 hartree
zpe.thermalcorrenthalpy: 0.398781 hartree
zpe.thermalcorrgfe: 0.301813 hartree
zpe.sumelectzpe: -2575.910069 hartree
zpe.sumelectthermal: -2575.879481 hartree
zpe.sumelectthermalent: -2575.878537 hartree
zpe.sumelectthermalfe: -2575.975505 hartree
dipole: 6.1236 -2.1052 -2.0567
dipole: 6.7941
quadrupole: -275.8461 -193.2667 -196.2575
quadrupole: -10.0281 -6.7461 2.4594
quadrupole: -54.0560 28.5234 25.5326 -10.0281 -6.7461 2.4594
hfenergy: -2576.2773176 hartree
pointgroup: C01 [X(C19H20Cl2F1N5O2S1)]
dipole: 2.4347357 -0.6197355 -0.9126739 debye
polarizability: 531.5402312|-14.0762057|272.7321739|22.5357061|14.9586479|199.2617601 unknown
InChI: InChI=1S/C19H20Cl2FN5O2S/c1-19(2)26-17(23)25-18(24)27(19)13-7-5-11(15(20)9-13)3-4-12-6-8-14(10-16(12)21)30(22,28)29/h5-10H,3-4,23-24H2,1-2H3
charge 0 multiplicity 1
50 atoms
Cl 0.118748 2.819005 0.079094
Cl -3.761288 2.502242 0.34952
S  -8.058125 -0.974311 -0.205023
F  -8.560809 -1.037161 1.580826
O  -8.742417 0.345438 -0.813253
O  -8.334866 -2.444724 -0.789428
N  4.536825 -0.012656 -0.072541
N  6.390628 -0.552878 1.483835
N  6.668662 -0.721199 -0.948009
N  4.899705 -0.321234 -2.409437
N  8.243274 -1.623044 0.518682
C  5.225864 0.325542 1.276861
C  3.116818 0.032733 -0.25702
C  5.700598 1.804543 1.237215
C  4.246205 0.076763 2.438775
C  -1.256198 0.080932 -0.759211
C  0.253552 0.092013 -0.605312
C  5.395485 -0.356666 -1.121262
C  -1.983528 -0.108992 0.617687
C  2.388851 1.234804 -0.053183
C  2.40631 -1.135916 -0.644789
C  0.992619 1.234778 -0.215624
C  1.010511 -1.092062 -0.822479
C  7.053311 -0.92923 0.39786
C  -3.4782 -0.29322 0.445827
C  -4.380133 0.793567 0.294233
C  -4.028711 -1.603434 0.392275
C  -6.227918 -0.706739 0.062499
C  -5.764025 0.616427 0.106774
C  -5.406017 -1.835685 0.201991
H  6.265968 2.021826 2.159818
H  6.371543 1.969791 0.375513
H  4.852157 2.51031 1.173063
H  3.877671 -0.962715 2.414002
H  4.810668 0.213493 3.37528
H  3.388681 0.769705 2.434926
H  -1.609117 1.023549 -1.214485
H  -1.54945 -0.74678 -1.430819
H  -1.768178 0.770845 1.24942
H  -1.558856 -0.997287 1.119058
H  2.911401 2.155674 0.215997
H  2.95873 -2.068284 -0.797846
H  0.478563 -2.000962 -1.128511
H  5.531506 -0.617748 -3.149277
H  3.999409 0.09475 -2.631596
H  -3.354625 -2.458667 0.511776
H  -6.44268 1.466556 -0.008488
H  -5.820137 -2.847133 0.158433
H  8.619154 -1.80665 1.4442
H  8.703162 -1.959712 -0.321553
