program: Gaussian 09
title: 000279449
version: EM64L-G09RevD.01
frameworkgroup: C1[X(C11H21ClN2O)]
method: RPBEPBE
basis: SDD
operation: Freq
keyword: #p
keyword: freq=noraman
keyword: PBEPBE/SDD
title: #p freq=noraman PBEPBE/SDD
converged: NO YES NO NO
title: Mulliken charges:
elementType: Cl O N N C C C C C C C C C C C H H H H H H H H H H H H H H H H H H H H H
charge: -0.076449 -0.307890 -0.441873 -0.423941 0.397179 -0.468307 -0.455464 -0.022345 -0.494686 -0.454037 -0.746926 -0.751859 0.303486 -0.326163 -0.550116 0.175540 0.209489 0.202482 0.197909 0.263231 0.216682 0.215634 0.244155 0.205951 0.214672 0.205272 0.210355 0.219519 0.214319 0.209667 0.282662 0.285607 0.272472 0.231285 0.294117 0.248373
chargesum: 0.00000
title: Mulliken charges with hydrogens summed into heavy atoms:
elementType: Cl O N N C C C C C C C C C C C
charge: -0.076449 -0.307890 -0.159211 -0.138334 0.397179 -0.083278 -0.055073 0.240885 -0.062370 -0.003930 -0.116626 -0.108354 0.303486 0.177594 -0.007627
polarizability: 1.92629508e+02 1.48641776e+00 1.18785322e+02 2.46499321e+00 -3.40418734e+00 1.22181054e+02
1716.lowfreq: -34.6594 -8.8470 -2.2105 0.0004 0.0014 0.0022 10.0225 23.5042 49.1402
frequency: -11.1149 22.9710 49.1379 56.4323 74.9991 84.9169 143.1146 167.2587 181.8639 206.9403 227.8615 232.2555 264.3830 282.9335 293.4956 302.1350 339.1528 375.8729 392.5304 403.1219 412.6139 471.2705 485.9917 491.3582 513.5935 651.1053 679.5044 685.2003 693.4389 719.2906 770.8596 784.1343 834.5741 855.2099 895.9924 927.2801 929.1078 943.1558 955.9005 978.9167 989.7347 1006.8321 1030.0582 1039.2869 1047.8086 1055.1860 1099.6312 1133.4457 1140.3271 1160.2465 1166.2831 1173.9779 1190.2641 1225.0609 1254.9676 1261.4435 1268.0701 1290.5415 1297.7036 1310.6845 1319.8941 1330.6579 1343.9944 1353.3330 1362.8676 1367.1709 1372.3132 1392.2001 1438.8916 1449.6691 1454.6605 1457.0303 1459.3541 1461.3502 1469.3248 1473.6914 1477.5258 1483.3491 1488.8212 1494.9775 1627.3562 2940.1137 2959.0492 2962.4182 2972.8894 2987.9256 2988.9962 3010.9368 3020.9130 3026.4079 3028.2410 3046.6773 3054.8608 3057.2971 3057.9098 3058.6036 3063.6811 3075.9827 3096.8048 3151.8965 3547.0386 3558.8811
redmass: 3.3205 5.0968 4.4950 5.1801 3.2393 3.9226 3.3970 1.1490 4.3758 1.9717 3.6452 1.1634 1.2825 1.9818 3.3640 3.3968 2.4828 2.3231 2.2874 1.9730 2.1607 2.5506 2.4299 1.8371 3.0308 3.0665 5.4391 3.4865 2.6534 6.3230 1.5203 1.3335 3.0848 2.0984 2.1381 1.5748 2.3883 1.6101 2.2005 1.6465 2.0130 1.4647 1.4820 2.2561 2.4595 2.4648 1.1492 2.2245 2.2928 1.3547 1.2488 1.9038 2.5771 1.6707 1.1758 2.2042 1.4881 1.9290 1.1594 1.6982 1.4013 1.4280 1.3933 1.5009 1.2710 1.2916 1.2076 1.2183 1.3558 1.1503 1.1579 1.0747 1.0786 1.0831 1.0834 1.0816 1.1357 1.0678 1.0643 1.9629 5.3561 1.0646 1.0440 1.0510 1.0377 1.0643 1.0658 1.0929 1.0949 1.0618 1.0875 1.1004 1.0992 1.0994 1.0988 1.0577 1.0986 1.0975 1.1032 1.1121 1.0774 1.0775
irintensity: 1.0058 0.6012 13.6625 4.7734 2.8883 1.1524 2.3185 0.2697 2.3614 0.7100 4.4983 0.1333 3.7505 0.4166 18.9780 3.6536 3.7129 1.1041 1.7109 0.6947 4.3156 47.3083 45.9669 124.8263 13.5796 3.1935 45.5738 13.3927 5.4560 15.3512 1.0437 12.0891 1.1680 1.4420 3.9923 2.3755 1.6050 0.6169 6.8916 13.1341 7.3546 2.5293 1.1529 7.9036 0.5295 1.8908 2.3501 3.8130 23.7493 10.2851 2.4339 12.1264 6.3242 168.5711 5.6606 15.8858 20.8538 3.3684 9.8977 31.8399 1.7249 13.3924 1.6143 3.2258 4.0462 2.5799 21.3271 14.2637 53.6563 9.0968 65.3492 11.1464 1.7661 2.0110 22.3471 43.0263 44.3861 18.2890 15.3902 618.6910 161.9028 42.9131 15.2923 72.4497 23.8871 21.2397 16.4548 53.9231 41.0124 30.7232 27.0349 33.5298 7.1454 33.2544 78.9450 18.8282 72.8501 43.3033 1.9556 11.1839 16.0996 10.8962
temp: 298.150 k
press: 1.00000 atm
elementType: 17 8 7 7 6 6 6 6 6 6 6 6 6 6 6 1 1 1 1 1 1 1 1 1 1 1 1 1 1 1 1 1 1 1 1 1
symmnumber: 1
zpe: 817452.5 jmol-1
zpe.correction: 0.311351 hartree
zpe.thermalcorrener: 0.327780 hartree
zpe.thermalcorrenthalpy: 0.328724 hartree
zpe.thermalcorrgfe: 0.266447 hartree
zpe.sumelectzpe: -1075.375962 hartree
zpe.sumelectthermal: -1075.359534 hartree
zpe.sumelectthermalent: -1075.358589 hartree
zpe.sumelectthermalfe: -1075.420866 hartree
dipole: -4.4149 1.2346 -4.0087
dipole: 6.0898
quadrupole: -116.5911 -102.3456 -96.7700
quadrupole: 1.8967 -8.2295 2.1771
quadrupole: -11.3555 2.8900 8.4655 1.8967 -8.2295 2.1771
hfenergy: -1075.6873136 hartree
pointgroup: C01 [X(C11H21Cl1N2O1)]
dipole: 1.7301004 0.6160748 1.5386931 debye
polarizability: 192.1217581|-4.9234226|120.1198859|4.7441293|3.4739078|121.3542399 unknown
InChI: InChI=1S/C11H21ClN2O/c1-11(2)5-3-9(4-6-11)14-10(15)13-8-7-12/h9,13-14H,3-8H2,1-2H3
charge 0 multiplicity 1
36 atoms
Cl -6.110021 1.169478 -0.595501
O  -1.883686 -1.23432 -0.913767
N  -0.219562 -0.601066 0.603292
N  -2.472684 -0.018657 0.996429
C  3.250883 0.696197 0.024855
C  2.804624 -0.219871 1.206673
C  2.023714 0.960325 -0.902328
C  0.876444 -1.221268 -0.178673
C  2.078591 -1.511084 0.751446
C  1.311267 -0.327849 -1.37198
C  3.758409 2.044839 0.595762
C  4.407608 0.032203 -0.770496
C  -1.535745 -0.652156 0.162084
C  -3.899664 -0.028749 0.652717
C  -4.250237 1.171041 -0.244696
H  2.141927 0.37271 1.87558
H  3.687819 -0.489234 1.819679
H  2.349055 1.552582 -1.780601
H  1.29413 1.590563 -0.351551
H  0.474597 -2.169294 -0.581396
H  2.786828 -2.157102 0.199634
H  1.740484 -2.092761 1.631238
H  0.418336 -0.08276 -1.974905
H  1.980797 -0.923345 -2.023694
H  4.077321 2.724464 -0.217364
H  2.964754 2.557932 1.172615
H  4.624553 1.893803 1.268564
H  4.116469 -0.937247 -1.211888
H  4.735526 0.689379 -1.598004
H  5.28079 -0.145769 -0.114073
H  0.020863 -0.118153 1.46957
H  -2.175106 0.45197 1.851337
H  -4.121866 -0.963236 0.111582
H  -4.504009 -0.003144 1.576651
H  -3.754398 1.098793 -1.223043
H  -4.04121 2.137784 0.238252
