program: Gaussian 09
title: 000279435
version: EM64L-G09RevD.01
frameworkgroup: C1[X(C15H10N4O)]
method: RPBEPBE
basis: SDD
operation: Freq
keyword: #p
keyword: freq=noraman
keyword: PBEPBE/SDD
title: #p freq=noraman PBEPBE/SDD
converged: NO YES NO NO
title: Mulliken charges:
elementType: O N N N N C C C C C C C C C C C C C C C H H H H H H H H H H
charge: -0.233391 -0.282748 0.055934 0.018441 0.000751 0.265574 0.192510 -0.153527 0.011612 -0.314393 -0.381409 0.184653 0.208283 0.046766 -0.207588 -0.240761 -0.746509 -0.283071 -0.422511 -0.324234 0.313200 0.269675 0.234035 0.235928 0.257821 0.259464 0.251580 0.259072 0.274391 0.250452
chargesum: 0.00000
title: Mulliken charges with hydrogens summed into heavy atoms:
elementType: O N N N N C C C C C C C C C C C C C C C
charge: -0.233391 -0.282748 0.055934 0.018441 0.000751 0.265574 0.192510 -0.153527 0.011612 -0.001194 -0.111734 0.184653 0.208283 0.046766 0.026447 -0.004833 0.023606 -0.025250 -0.148121 -0.073782
polarizability: 3.53405917e+02 -1.18201086e+01 2.11121179e+02 -1.01027824e-03 7.70355808e-03 7.55331379e+01
1716.lowfreq: -2.9792 -0.0006 -0.0003 0.0004 5.1508 8.3613 51.6598 66.8820 75.4512
frequency: 51.6502 66.8683 75.4505 116.6192 145.3446 163.8834 174.3871 201.1881 232.0968 314.1363 321.2856 332.8016 362.3479 364.4903 409.8067 414.5462 468.2381 482.2595 535.7018 546.4022 558.9352 586.8077 587.2624 605.9411 606.9272 622.5093 678.0879 713.4717 740.8611 768.3709 770.0189 787.6151 823.5821 841.1763 854.9168 897.7629 909.5750 924.2802 928.9035 968.8687 973.1251 1002.6964 1002.9549 1010.6417 1013.6634 1038.3585 1048.6562 1104.6461 1164.4075 1167.7335 1181.5088 1199.1364 1225.2576 1233.0116 1257.0334 1280.2093 1322.2647 1334.1275 1356.7475 1388.5192 1394.0626 1399.3900 1419.2837 1430.0680 1445.5069 1447.8749 1468.7387 1486.2631 1522.3253 1546.2851 1585.9832 1592.4700 1619.3759 1630.4062 3012.4234 3099.5253 3139.7740 3139.9920 3140.4863 3147.6412 3156.0320 3173.0911 3173.2167 3217.6826
redmass: 3.7638 5.9984 6.2976 4.3917 5.5360 1.0404 5.9923 5.4058 6.4799 4.4557 4.2335 9.2859 4.1525 6.7804 6.8579 4.1170 5.0952 3.7657 7.6693 3.3263 6.6334 4.3857 5.7818 7.4688 3.7415 9.2580 6.3304 7.2362 4.2210 5.9553 1.7691 2.7052 4.7406 1.3914 7.8539 1.4147 5.0020 1.5392 7.5371 1.4248 1.3840 1.3202 2.3976 3.0475 2.2748 1.6985 2.8554 1.9305 1.4043 2.0250 2.6625 2.8107 2.1063 3.8460 2.5095 2.8245 1.8231 3.2356 6.6113 1.3192 3.5815 3.3713 3.1197 1.1303 2.6196 1.0456 2.9610 4.4092 8.5635 10.0986 7.6934 7.2715 8.3328 8.4694 1.0361 1.0959 1.1026 1.0871 1.0914 1.0894 1.0920 1.0986 1.0988 1.0950
irintensity: 2.4730 5.4163 0.4621 0.0015 0.5159 0.0941 0.0761 4.7641 0.2935 6.5168 0.1541 0.8530 3.9280 3.7781 0.9465 0.1978 21.6630 3.1038 1.9289 0.2507 4.4885 4.6365 30.7467 12.7089 3.1350 4.2595 5.4799 2.9088 9.0221 11.0433 62.5857 15.5831 5.3266 54.1427 5.3804 0.8015 2.1702 2.9601 3.6883 0.2085 5.1421 1.1894 41.5409 13.8229 7.0401 7.6574 7.5484 13.8497 7.4887 8.5548 66.2938 61.9289 38.1180 11.4158 47.6334 273.6583 7.9084 181.2513 139.9432 22.5985 55.2466 46.0302 22.0914 43.2329 96.5423 19.7861 10.9823 28.7855 17.8391 19.0463 10.5195 3.6019 67.1510 207.5801 1.2048 3.6850 15.6485 4.9586 6.4612 6.6170 13.4586 39.7892 0.5099 4.2473
temp: 298.150 k
press: 1.00000 atm
elementType: 8 7 7 7 7 6 6 6 6 6 6 6 6 6 6 6 6 6 6 6 1 1 1 1 1 1 1 1 1 1
symmnumber: 1
zpe: 578083.3 jmol-1
zpe.correction: 0.220180 hartree
zpe.thermalcorrener: 0.234939 hartree
zpe.thermalcorrenthalpy: 0.235883 hartree
zpe.thermalcorrgfe: 0.178238 hartree
zpe.sumelectzpe: -870.498273 hartree
zpe.sumelectthermal: -870.483514 hartree
zpe.sumelectthermalent: -870.482570 hartree
zpe.sumelectthermalfe: -870.540216 hartree
dipole: 1.1154 0.5282 0.0116
dipole: 1.2342
quadrupole: -120.8499 -109.3373 -117.0370
quadrupole: -20.4392 0.0238 0.0161
quadrupole: -5.1085 6.4041 -1.2956 -20.4392 0.0238 0.0161
hfenergy: -870.7184533 hartree
pointgroup: C01 [X(C15H10N4O1)]
dipole: 0.4373117 -0.2098844 -0.0216747 debye
polarizability: 353.5425998|10.9626132|210.4274795|-1.6657339|8.5107742|76.0901543 unknown
InChI: InChI=1S/C15H10N4O/c1-9(20)19-13-5-3-2-4-10(13)14-15(19)18-11-6-7-16-8-12(11)17-14/h2-8H,1H3
charge 0 multiplicity 1
30 atoms
O  2.967015 -2.71562 -0.264501
N  1.302611 -1.092069 -0.149617
N  -1.069762 1.635548 0.044919
N  -1.159045 -1.29296 -0.142935
N  -4.718156 1.04655 0.037282
C  2.201412 0.042268 -0.085052
C  1.434493 1.247734 -0.001866
C  0.032775 0.87243 -0.013532
C  -0.025009 -0.589728 -0.106938
C  3.610334 0.078021 -0.095737
C  2.065992 2.507208 0.071386
C  -2.317784 -0.517134 -0.083615
C  1.734976 -2.459847 -0.239762
C  -2.268976 0.930548 0.009608
C  4.228067 1.349737 -0.021717
C  3.475129 2.551218 0.060814
C  0.674381 -3.53765 -0.304302
C  -3.600159 -1.139664 -0.113447
C  -3.510312 1.64431 0.066071
C  -4.744776 -0.337287 -0.052231
H  4.195576 -0.83843 -0.158621
H  1.462178 3.417517 0.134029
H  5.322421 1.401808 -0.028755
H  3.994113 3.513532 0.116385
H  -3.665008 -2.229206 -0.183266
H  0.016721 -3.510152 0.580527
H  1.192802 -4.505642 -0.368064
H  0.01086 -3.398232 -1.174116
H  -3.481947 2.737245 0.136532
H  -5.74452 -0.783055 -0.072979
